Home Dashboard Directory Help
Search

C3861 Error in VS2010 by Jymmi88


Status: 

Closed
 as Not Reproducible Help for as Not Reproducible


11
0
Sign in
to vote
Type: Bug
ID: 666237
Opened: 5/2/2011 11:49:15 AM
Access Restriction: Public
4
Workaround(s)
view
10
User(s) can reproduce this bug

Description

VS 2010 C++ builds are generating this error in my production environment:
c:\Program Files\Microsoft Visual Studio 10.0\VC\atlmfc\include\atltransactionmanager.h(262): error C3861: 'AtlLoadSystemLibraryUsingFullPath': identifier not found

Developers in other forums are recently reporting the same exact error.
Details
Sign in to post a comment.
Posted by ChristianTr on 12/5/2011 at 12:53 AM
I found a solution, see work-arounds.
Posted by ChristianTr on 12/1/2011 at 10:52 AM
I have the same problem. AtlLoadSystemLibraryUsingFullPath is not present in atlcore.h, but it is called in atltransactionmanager.h.

Might be due to an incomplete security update. AtlLoadSystemLibraryUsingFullPath should be used in order to stop binary planting (exploiting dll loading).

I installed VS security patch KB2565057 where atlcore.h should be replaced, but it wasn't. Error persists. For KB2565057, see http://blog.m-ri.de/index.php/2011/08/12/anderungen-in-den-vc-libraries-des-sicherheitsupdates-vom-09-08-2011/



1>------ Rebuild All started: Project: Tests, Configuration: Release Win32 ------
1>Build started 01.12.2011 16:26:21.
1>Environment at start of build:
1>MSBuildExtensionsPath32 = C:\Programme\MSBuild
1>MSBuildExtensionsPath = C:\Programme\MSBuild
1>LocalAppData = C:\Dokumente und Einstellungen\ctroester\Lokale Einstellungen\Anwendungsdaten
1>ALLUSERSPROFILE = C:\Dokumente und Einstellungen\All Users
1>APPDATA = C:\Dokumente und Einstellungen\ctroester\Anwendungsdaten
1>BASEDIR = C:\WinDDK\7600.16385.1
1>CommonProgramFiles = C:\Programme\Gemeinsame Dateien
1>COMPUTERNAME = GP11095
1>ComSpec = C:\WINDOWS\system32\cmd.exe
1>DDKPATH = C:\WinDDK\7600.16385.1
1>DDKROOT = C:\WinDDK\7600.16385.1
1>Toaster_INC = C:\Programme\Company\Toaster\Include
1>Toaster_WRAPPER = C:\test
1>FP_NO_HOST_CHECK = NO
1>HOMEDRIVE = U:
1>HOMEPATH = \
1>HOMESHARE = \\^-\user\ctroester
1>INCLUDE = C:\Programme\Microsoft Visual Studio .NET 2003\SDK\v1.1\include\
1>LDMS_LOCAL_DIR = C:\Programme\LANDesk\LDClient\Data
1>LIB = C:\Programme\Microsoft Visual Studio .NET 2003\SDK\v1.1\Lib\
1>LOGONSERVER = \\-
1>NEW3 = abcdef
1>NTMAKEENV = C:\WinDDK\7600.16385.1\bin
1>NUMBER_OF_PROCESSORS = 2
1>OS = Windows_NT
1>Path = c:\programme\mentorgraphics\2005EXP\SDD_HOME\common\win32\bin;c:\programme\mentorgraphics\2005EXP\SDD_HOME\common\win32\lib;C:\Programme\Windows Resource Kits\Tools\;C:\WINDOWS\system32;C:\WINDOWS;C:\WINDOWS\System32\Wbem;C:\Programme\Microsoft SQL Server\90\Tools\binn\;C:\Programme\doxygen\bin;C:\MinGw\bin;C:\Programme\TortoiseSVN\bin;C:\qt\commercial_MinGw_4_6_1\bin;C:\Programme\Cppcheck\;C:\Programme\ATI Technologies\ATI.ACE\Core-Static;C:\Programme\SlikSvn\bin\;C:\Programme\Company\Toaster\Tools;C:\Programme\Company\FlexXCon_midget-toolset_S2V0-F\eclipse;C:\Programme\Company\FlexXCon_midget-toolset_S2V0-F\powerpc-eabispe\bin;C:\Programme\Company\FlexXCon_midget-toolset_S2V0-F\usr
1>PATHEXT = .COM;.EXE;.BAT;.CMD;.VBS;.VBE;.JS;.JSE;.WSF;.WSH
1>PROCESSOR_ARCHITECTURE = x86
1>PROCESSOR_IDENTIFIER = x86 Family 15 Model 6 Stepping 4, GenuineIntel
1>PROCESSOR_LEVEL = 15
1>PROCESSOR_REVISION = 0604
1>ProgramFiles = C:\Programme
1>QTDIR = C:\qt\commercial_MinGw_4_6_1
1>QTDIR_win32-gcc = C:\qt\commercial_MinGw_4_6_1
1>REMOTE_DEBUG_DIR = d:\_arbeit
1>REMOTE_DEBUG_SHARE = \\ebel-18dcce3b53\Remote
1>REMOTE_DEBUG_TARGET = ebel-18dcce3b53
1>SDD_COMMON_BIN = c:\programme\mentorgraphics\2005EXP\SDD_HOME\common\win32\bin
1>SDD_HOME = c:\programme\mentorgraphics\2005EXP\SDD_HOME
1>SDD_LOCAL = C:\Dokumente und Einstellungen\All Users\Anwendungsdaten\mgc\2005EXP
1>SDD_PCBIND = pcbind
1>SDD_PLATFORM = win32
1>SDD_START = start
1>SDD_STARTBAT = start /b /wait
1>SDD_VERSION = 2005EXP
1>SDD_WG = wg
1>SDD_XE = xe
1>SESSIONNAME = Console
1>SystemDrive = C:
1>SystemRoot = C:\WINDOWS
1>TEMP = C:\DOKUME~1\ctroester\LOKALE~1\Temp
1>TMP = C:\DOKUME~1\ctroester\LOKALE~1\Temp
1>USERDNSDOMAIN = DEES.EBERSPAECHER.COM
1>USERDOMAIN = DEES
1>USERNAME = ctroester
1>USERPROFILE = C:\Dokumente und Einstellungen\ctroester
1>VisualStudioDir = C:\Dokumente und Einstellungen\ctroester\Eigene Dateien\Visual Studio 2010
1>VS100COMNTOOLS = c:\Programme\Microsoft Visual Studio 10.0\Common7\Tools\
1>VS71COMNTOOLS = C:\Programme\Microsoft Visual Studio .NET 2003\Common7\Tools\
1>VS80COMNTOOLS = C:\Programme\Microsoft Visual Studio 8\Common7\Tools\
1>VS90COMNTOOLS = c:\Programme\Microsoft Visual Studio 9.0\Common7\Tools\
1>WDF_DDK = C:\WinDDK\7600.16385.1
1>WDF_ROOT = C:\WinDDK\7600.16385.1
1>WF_CLASSPATH = c:\programme\mentorgraphics\2005EXP\SDD_HOME\common\win32\lib
1>WIN7BASE = C:\WinDDK\7600.16385.1
1>windir = C:\WINDOWS
1>WIX = C:\Programme\Windows Installer XML v3\
1>WLHBASE = C:\WinDDK\7600.16385.1
1>WNETBASE = C:\WinDDK\7600.16385.1
1>
1>Building with tools version "4.0".
1>Target "_CheckForInvalidConfigurationAndPlatform: (TargetId:2)" in file "c:\WINDOWS\Microsoft.NET\Framework\v4.0.30319\Microsoft.Common.Targets" from project "C:\_Arbeit\_Projekte\3-0009_Toaster\trunk\K03_fcBase\Tests\Tests.vcxproj" (entry point):
1>Task "Error" skipped, due to false condition; ( '$(_InvalidConfigurationError)' == 'true' ) was evaluated as ( '' == 'true' ).
1>Task "Warning" skipped, due to false condition; ( '$(_InvalidConfigurationWarning)' == 'true' ) was evaluated as ( '' == 'true' ).
1>Using "Message" task from assembly "Microsoft.Build.Tasks.v4.0, Version=4.0.0.0, Culture=neutral, PublicKeyToken=b03f5f7f11d50a3a".
1>Task "Message" (TaskId:2)
1> Configuration=Release (TaskId:2)
1>Done executing task "Message". (TaskId:2)
1>Task "Message" (TaskId:3)
1> Platform=Win32 (TaskId:3)
1>Done executing task "Message". (TaskId:3)
1>Task "Error" skipped, due to false condition; ('$(OutDir)' != '' and !HasTrailingSlash('$(OutDir)')) was evaluated as ('..\Release\Win32\' != '' and !HasTrailingSlash('..\Release\Win32\')).
1>Task "Error" skipped, due to false condition; ('$(BaseIntermediateOutputPath)' != '' and !HasTrailingSlash('$(BaseIntermediateOutputPath)')) was evaluated as ('obj\' != '' and !HasTrailingSlash('obj\')).
1>Task "Error" skipped, due to false condition; ('$(IntermediateOutputPath)' != '' and !HasTrailingSlash('$(IntermediateOutputPath)')) was evaluated as ('Release\Win32\' != '' and !HasTrailingSlash('Release\Win32\')).
1>Done building target "_CheckForInvalidConfigurationAndPlatform" in project "Tests.vcxproj".: (TargetId:2)
1>Target "_DetermineManagedStateFromCL: (TargetId:3)" in file "C:\Programme\MSBuild\Microsoft.Cpp\v4.0\Microsoft.CppBuild.targets" from project "C:\_Arbeit\_Projekte\3-0009_Toaster\trunk\K03_fcBase\Tests\Tests.vcxproj" (target "Rebuild" depends on it):
1>Done building target "_DetermineManagedStateFromCL" in project "Tests.vcxproj".: (TargetId:3)
1>Target "_PrepareForRebuild: (TargetId:4)" in file "C:\Programme\MSBuild\Microsoft.Cpp\v4.0\Microsoft.BuildSteps.Targets" from project "C:\_Arbeit\_Projekte\3-0009_Toaster\trunk\K03_fcBase\Tests\Tests.vcxproj" (target "Rebuild" depends on it):
1>Done building target "_PrepareForRebuild" in project "Tests.vcxproj".: (TargetId:4)
1>Target "BeforeRebuild: (TargetId:5)" in file "c:\WINDOWS\Microsoft.NET\Framework\v4.0.30319\Microsoft.Common.Targets" from project "C:\_Arbeit\_Projekte\3-0009_Toaster\trunk\K03_fcBase\Tests\Tests.vcxproj" (target "Rebuild" depends on it):
1>Done building target "BeforeRebuild" in project "Tests.vcxproj".: (TargetId:5)
1>Target "_PrepareForClean: (TargetId:6)" in file "C:\Programme\MSBuild\Microsoft.Cpp\v4.0\Microsoft.BuildSteps.Targets" from project "C:\_Arbeit\_Projekte\3-0009_Toaster\trunk\K03_fcBase\Tests\Tests.vcxproj" (target "Clean" depends on it):
1>Using "Delete" task from assembly "Microsoft.Build.Tasks.v4.0, Version=4.0.0.0, Culture=neutral, PublicKeyToken=b03f5f7f11d50a3a".
1>Task "Delete" (TaskId:4)
1> Deleting file "Release\Win32\Tests.lastbuildstate". (TaskId:4)
1>Done executing task "Delete". (TaskId:4)
1>Done building target "_PrepareForClean" in project "Tests.vcxproj".: (TargetId:6)
1>Target "BeforeClean: (TargetId:7)" in file "c:\WINDOWS\Microsoft.NET\Framework\v4.0.30319\Microsoft.Common.Targets" from project "C:\_Arbeit\_Projekte\3-0009_Toaster\trunk\K03_fcBase\Tests\Tests.vcxproj" (target "Clean" depends on it):
1>Done building target "BeforeClean" in project "Tests.vcxproj".: (TargetId:7)
1>Target "UnmanagedUnregistration" skipped, due to false condition; ((('$(_AssemblyTimestampBeforeCompile)' != '$(_AssemblyTimestampAfterCompile)' or '$(RegisterForComInterop)' != 'true' or '$(OutputType)' != 'library') or
1>                    ('$(_AssemblyTimestampBeforeCompile)' == '')) and
1>                 Exists('@(_UnmanagedRegistrationCache)')) was evaluated as ((('' != '' or '' != 'true' or 'exe' != 'library') or
1>                    ('' == '')) and
1>                 Exists('obj\Tests.vcxproj.UnmanagedRegistration.cache')).
1>Target "CoreClean: (TargetId:8)" in file "c:\WINDOWS\Microsoft.NET\Framework\v4.0.30319\Microsoft.Common.Targets" from project "C:\_Arbeit\_Projekte\3-0009_Toaster\trunk\K03_fcBase\Tests\Tests.vcxproj" (target "Clean" depends on it):
1>Task "Delete" (TaskId:5)
1>Done executing task "Delete". (TaskId:5)
1>Using "ReadLinesFromFile" task from assembly "Microsoft.Build.Tasks.v4.0, Version=4.0.0.0, Culture=neutral, PublicKeyToken=b03f5f7f11d50a3a".
1>Task "ReadLinesFromFile" (TaskId:6)
1>Done executing task "ReadLinesFromFile". (TaskId:6)
1>Using "FindUnderPath" task from assembly "Microsoft.Build.Tasks.v4.0, Version=4.0.0.0, Culture=neutral, PublicKeyToken=b03f5f7f11d50a3a".
1>Task "FindUnderPath" (TaskId:7)
1> Comparison path is "..\Release\Win32\". (TaskId:7)
1>Done executing task "FindUnderPath". (TaskId:7)
1>Task "FindUnderPath" (TaskId:8)
1> Comparison path is "Release\Win32\". (TaskId:8)
1>Done executing task "FindUnderPath". (TaskId:8)
1>Task "Delete" (TaskId:9)
1>Done executing task "Delete". (TaskId:9)
1>Using "RemoveDuplicates" task from assembly "Microsoft.Build.Tasks.v4.0, Version=4.0.0.0, Culture=neutral, PublicKeyToken=b03f5f7f11d50a3a".
1>Task "RemoveDuplicates" (TaskId:10)
1>Done executing task "RemoveDuplicates". (TaskId:10)
1>Using "MakeDir" task from assembly "Microsoft.Build.Tasks.v4.0, Version=4.0.0.0, Culture=neutral, PublicKeyToken=b03f5f7f11d50a3a".
1>Task "MakeDir" (TaskId:11)
1>Done executing task "MakeDir". (TaskId:11)
1>Using "WriteLinesToFile" task from assembly "Microsoft.Build.Tasks.v4.0, Version=4.0.0.0, Culture=neutral, PublicKeyToken=b03f5f7f11d50a3a".
1>Task "WriteLinesToFile" (TaskId:12)
1>Done executing task "WriteLinesToFile". (TaskId:12)
1>Done building target "CoreClean" in project "Tests.vcxproj".: (TargetId:8)
1>Target "AssignProjectConfiguration: (TargetId:9)" in file "c:\WINDOWS\Microsoft.NET\Framework\v4.0.30319\Microsoft.Common.Targets" from project "C:\_Arbeit\_Projekte\3-0009_Toaster\trunk\K03_fcBase\Tests\Tests.vcxproj" (target "CleanReferencedProjects" depends on it):
1>Using "AssignProjectConfiguration" task from assembly "Microsoft.Build.Tasks.v4.0, Version=4.0.0.0, Culture=neutral, PublicKeyToken=b03f5f7f11d50a3a".
1>Task "AssignProjectConfiguration" (TaskId:13)
1> Project reference "..\K03_fcBase.vcxproj" has been assigned the "Release|Win32" configuration. (TaskId:13)
1>Done executing task "AssignProjectConfiguration". (TaskId:13)
1>Done building target "AssignProjectConfiguration" in project "Tests.vcxproj".: (TargetId:9)
1>Target "_SplitProjectReferencesByFileExistence: (TargetId:10)" in file "c:\WINDOWS\Microsoft.NET\Framework\v4.0.30319\Microsoft.Common.Targets" from project "C:\_Arbeit\_Projekte\3-0009_Toaster\trunk\K03_fcBase\Tests\Tests.vcxproj" (target "CleanReferencedProjects" depends on it):
1>Using "ResolveNonMSBuildProjectOutput" task from assembly "Microsoft.Build.Tasks.v4.0, Version=4.0.0.0, Culture=neutral, PublicKeyToken=b03f5f7f11d50a3a".
1>Task "ResolveNonMSBuildProjectOutput" (TaskId:14)
1> Resolving project reference "..\K03_fcBase.vcxproj". (TaskId:14)
1> Project reference "..\K03_fcBase.vcxproj" has not been resolved. (TaskId:14)
1>Done executing task "ResolveNonMSBuildProjectOutput". (TaskId:14)
1>Done building target "_SplitProjectReferencesByFileExistence" in project "Tests.vcxproj".: (TargetId:10)
1>Target "CleanReferencedProjects: (TargetId:11)" in file "c:\WINDOWS\Microsoft.NET\Framework\v4.0.30319\Microsoft.Common.Targets" from project "C:\_Arbeit\_Projekte\3-0009_Toaster\trunk\K03_fcBase\Tests\Tests.vcxproj" (target "Clean" depends on it):
1>Task "MSBuild" skipped, due to false condition; ('$(BuildingInsideVisualStudio)' != 'true' and '$(BuildProjectReferences)' == 'true' and '@(_MSBuildProjectReferenceExistent)' != '') was evaluated as ('true' != 'true' and 'true' == 'true' and '..\K03_fcBase.vcxproj' != '').
1>Done building target "CleanReferencedProjects" in project "Tests.vcxproj".: (TargetId:11)
1>Target "CleanPublishFolder: (TargetId:12)" in file "c:\WINDOWS\Microsoft.NET\Framework\v4.0.30319\Microsoft.Common.Targets" from project "C:\_Arbeit\_Projekte\3-0009_Toaster\trunk\K03_fcBase\Tests\Tests.vcxproj" (target "Clean" depends on it):
1>Task "RemoveDir" skipped, due to false condition; ('$(PublishDir)'=='$(OutputPath)app.publish\' and Exists('$(PublishDir)')) was evaluated as ('C:\_Arbeit\_Projekte\3-0009_Toaster\trunk\K03_fcBase\Release\app.publish\'=='C:\_Arbeit\_Projekte\3-0009_Toaster\trunk\K03_fcBase\Release\app.publish\' and Exists('C:\_Arbeit\_Projekte\3-0009_Toaster\trunk\K03_fcBase\Release\app.publish\')).
1>Done building target "CleanPublishFolder" in project "Tests.vcxproj".: (TargetId:12)
1>Target "AfterClean: (TargetId:13)" in file "c:\WINDOWS\Microsoft.NET\Framework\v4.0.30319\Microsoft.Common.Targets" from project "C:\_Arbeit\_Projekte\3-0009_Toaster\trunk\K03_fcBase\Tests\Tests.vcxproj" (target "Clean" depends on it):
1>Done building target "AfterClean" in project "Tests.vcxproj".: (TargetId:13)
1>Target "EntityClean" skipped, due to false condition; ('@(EntityDeploy)' != '') was evaluated as ('' != '').
1>Target "BeforeCppClean: (TargetId:14)" in file "C:\Programme\MSBuild\Microsoft.Cpp\v4.0\Microsoft.CppClean.targets" from project "C:\_Arbeit\_Projekte\3-0009_Toaster\trunk\K03_fcBase\Tests\Tests.vcxproj" (target "CppClean" depends on it):
1>Done building target "BeforeCppClean" in project "Tests.vcxproj".: (TargetId:14)
1>Target "CoreCppClean: (TargetId:15)" in file "C:\Programme\MSBuild\Microsoft.Cpp\v4.0\Microsoft.CppClean.targets" from project "C:\_Arbeit\_Projekte\3-0009_Toaster\trunk\K03_fcBase\Tests\Tests.vcxproj" (target "CppClean" depends on it):
1>Task "MakeDir" (TaskId:15)
1>Done executing task "MakeDir". (TaskId:15)
1>Using "CppClean" task from assembly "Microsoft.Build.CppTasks.Common, Version=4.0.0.0, Culture=neutral, PublicKeyToken=b03f5f7f11d50a3a".
1>Task "CppClean" (TaskId:16)
1>Done executing task "CppClean". (TaskId:16)
1>Task "WriteLinesToFile" (TaskId:17)
1>Done executing task "WriteLinesToFile". (TaskId:17)
1>Done building target "CoreCppClean" in project "Tests.vcxproj".: (TargetId:15)
1>Target "AfterCppClean: (TargetId:16)" in file "C:\Programme\MSBuild\Microsoft.Cpp\v4.0\Microsoft.CppClean.targets" from project "C:\_Arbeit\_Projekte\3-0009_Toaster\trunk\K03_fcBase\Tests\Tests.vcxproj" (target "CppClean" depends on it):
1>Done building target "AfterCppClean" in project "Tests.vcxproj".: (TargetId:16)
1>Target "PGInstrumentedClean: (TargetId:17)" in file "C:\Programme\MSBuild\Microsoft.Cpp\v4.0\Microsoft.CppClean.targets" from project "C:\_Arbeit\_Projekte\3-0009_Toaster\trunk\K03_fcBase\Tests\Tests.vcxproj" (target "CppClean" depends on it):
1>Task "Delete" (TaskId:18)
1>Done executing task "Delete". (TaskId:18)
1>Done building target "PGInstrumentedClean" in project "Tests.vcxproj".: (TargetId:17)
1>Target "CppClean: (TargetId:18)" in file "C:\Programme\MSBuild\Microsoft.Cpp\v4.0\Microsoft.CppClean.targets" from project "C:\_Arbeit\_Projekte\3-0009_Toaster\trunk\K03_fcBase\Tests\Tests.vcxproj" (target "Clean" depends on it):
1>Done building target "CppClean" in project "Tests.vcxproj".: (TargetId:18)
1>Target "Clean: (TargetId:19)" in file "c:\WINDOWS\Microsoft.NET\Framework\v4.0.30319\Microsoft.Common.Targets" from project "C:\_Arbeit\_Projekte\3-0009_Toaster\trunk\K03_fcBase\Tests\Tests.vcxproj" (target "Rebuild" depends on it):
1>Done building target "Clean" in project "Tests.vcxproj".: (TargetId:19)
1>Target "_DetermineManagedStateFromCL" skipped. Previously built successfully.
1>Target "_PrepareForBuild: (TargetId:20)" in file "C:\Programme\MSBuild\Microsoft.Cpp\v4.0\Microsoft.BuildSteps.Targets" from project "C:\_Arbeit\_Projekte\3-0009_Toaster\trunk\K03_fcBase\Tests\Tests.vcxproj" (target "Build" depends on it):
1>Done building target "_PrepareForBuild" in project "Tests.vcxproj".: (TargetId:20)
1>Target "SetBuildDefaultEnvironmentVariables: (TargetId:21)" in file "C:\Programme\MSBuild\Microsoft.Cpp\v4.0\Microsoft.Cpp.targets" from project "C:\_Arbeit\_Projekte\3-0009_Toaster\trunk\K03_fcBase\Tests\Tests.vcxproj" (target "Build" depends on it):
1>Using "SetEnv" task from assembly "Microsoft.Build.CppTasks.Common, Version=4.0.0.0, Culture=neutral, PublicKeyToken=b03f5f7f11d50a3a".
1>Task "SetEnv" (TaskId:19)
1> PATH=c:\Programme\Microsoft Visual Studio 10.0\VC\bin;C:\Programme\Microsoft SDKs\Windows\v7.0A\bin\NETFX 4.0 Tools;C:\Programme\Microsoft SDKs\Windows\v7.0A\bin;C:\Programme\Microsoft Visual Studio 10.0\Common7\Tools\bin;C:\Programme\Microsoft Visual Studio 10.0\Common7\tools;C:\Programme\Microsoft Visual Studio 10.0\Common7\ide;C:\Programme\HTML Help Workshop;C:\Programme\Microsoft SDKs\Windows\v7.0A\\bin;c:\WINDOWS\Microsoft.NET\Framework\v4.0.30319\;C:\Programme\Microsoft Visual Studio 10.0\;C:\WINDOWS\SysWow64;;c:\programme\mentorgraphics\2005EXP\SDD_HOME\common\win32\bin;c:\programme\mentorgraphics\2005EXP\SDD_HOME\common\win32\lib;C:\Programme\Windows Resource Kits\Tools\;C:\WINDOWS\system32;C:\WINDOWS;C:\WINDOWS\System32\Wbem;C:\Programme\Microsoft SQL Server\90\Tools\binn\;C:\Programme\doxygen\bin;C:\MinGw\bin;C:\Programme\TortoiseSVN\bin;C:\qt\commercial_MinGw_4_6_1\bin;C:\Programme\Cppcheck\;C:\Programme\ATI Technologies\ATI.ACE\Core-Static;C:\Programme\SlikSvn\bin\;C:\Programme\Company\Toaster\Tools;C:\Programme\Company\FlexXCon_midget-toolset_S2V0-F\eclipse;C:\Programme\Company\FlexXCon_midget-toolset_S2V0-F\powerpc-eabispe\bin;C:\Programme\Company\FlexXCon_midget-toolset_S2V0-F\usr; (TaskId:19)
1>Done executing task "SetEnv". (TaskId:19)
1>Task "SetEnv" skipped, due to false condition; ('$(_IsNativeEnvironment)' == 'true') was evaluated as ('' == 'true').
1>Task "SetEnv" (TaskId:20)
1> LIB=c:\Programme\Microsoft Visual Studio 10.0\VC\lib;c:\Programme\Microsoft Visual Studio 10.0\VC\atlmfc\lib;C:\Programme\Microsoft SDKs\Windows\v7.0A\lib;C:\Programme\Microsoft SDKs\Windows\v7.0A\\lib (TaskId:20)
1>Done executing task "SetEnv". (TaskId:20)
1>Task "SetEnv" (TaskId:21)
1> LIBPATH=c:\Programme\Microsoft Visual Studio 10.0\VC\atlmfc\lib;c:\Programme\Microsoft Visual Studio 10.0\VC\lib (TaskId:21)
1>Done executing task "SetEnv". (TaskId:21)
1>Task "SetEnv" (TaskId:22)
1> INCLUDE=c:\Programme\Microsoft Visual Studio 10.0\VC\include;c:\Programme\Microsoft Visual Studio 10.0\VC\atlmfc\include;C:\Programme\Microsoft SDKs\Windows\v7.0A\include;C:\Programme\Microsoft SDKs\Windows\v7.0A\\include; (TaskId:22)
1>Done executing task "SetEnv". (TaskId:22)
1>Done building target "SetBuildDefaultEnvironmentVariables" in project "Tests.vcxproj".: (TargetId:21)
1>Target "SetUserMacroEnvironmentVariables" skipped, due to false condition; ('@(BuildMacro)' != '') was evaluated as ('' != '').
1>Target "BeforeResolveReferences: (TargetId:22)" in file "c:\WINDOWS\Microsoft.NET\Framework\v4.0.30319\Microsoft.Common.Targets" from project "C:\_Arbeit\_Projekte\3-0009_Toaster\trunk\K03_fcBase\Tests\Tests.vcxproj" (target "ResolveReferences" depends on it):
1>Done building target "BeforeResolveReferences" in project "Tests.vcxproj".: (TargetId:22)
1>Target "AssignProjectConfiguration" skipped. Previously built successfully.
1>Target "AssignProjectConfiguration" skipped. Previously built successfully.
1>Target "_SplitProjectReferencesByFileExistence" skipped. Previously built successfully.
1>Target "_RemoveNameMetadataFromProjectReferenceItems: (TargetId:23)" in file "C:\Programme\MSBuild\Microsoft.Cpp\v4.0\Microsoft.CppBuild.targets" from project "C:\_Arbeit\_Projekte\3-0009_Toaster\trunk\K03_fcBase\Tests\Tests.vcxproj" (target "ResolveProjectReferences" depends on it):
1>Done building target "_RemoveNameMetadataFromProjectReferenceItems" in project "Tests.vcxproj".: (TargetId:23)
1>Target "ResolveProjectReferences: (TargetId:24)" in file "c:\WINDOWS\Microsoft.NET\Framework\v4.0.30319\Microsoft.Common.Targets" from project "C:\_Arbeit\_Projekte\3-0009_Toaster\trunk\K03_fcBase\Tests\Tests.vcxproj" (target "ResolveReferences" depends on it):
1>Using "MSBuild" task from assembly "Microsoft.Build.Tasks.v4.0, Version=4.0.0.0, Culture=neutral, PublicKeyToken=b03f5f7f11d50a3a".
1>Task "MSBuild" (TaskId:23)
1> Global Properties: (TaskId:23)
1>    Configuration=Release (TaskId:23)
1>    Platform=Win32 (TaskId:23)
1>Building with tools version "4.0".
1>Target "_CheckForInvalidConfigurationAndPlatform: (TargetId:2)" in file "c:\WINDOWS\Microsoft.NET\Framework\v4.0.30319\Microsoft.Common.Targets" from project "C:\_Arbeit\_Projekte\3-0009_Toaster\trunk\K03_fcBase\K03_fcBase.vcxproj" (entry point):
1>Task "Error" skipped, due to false condition; ( '$(_InvalidConfigurationError)' == 'true' ) was evaluated as ( '' == 'true' ).
1>Task "Warning" skipped, due to false condition; ( '$(_InvalidConfigurationWarning)' == 'true' ) was evaluated as ( '' == 'true' ).
1>Using "Message" task from assembly "Microsoft.Build.Tasks.v4.0, Version=4.0.0.0, Culture=neutral, PublicKeyToken=b03f5f7f11d50a3a".
1>Task "Message" (TaskId:2)
1> Configuration=Release (TaskId:2)
1>Done executing task "Message". (TaskId:2)
1>Task "Message" (TaskId:3)
1> Platform=Win32 (TaskId:3)
1>Done executing task "Message". (TaskId:3)
1>Task "Error" skipped, due to false condition; ('$(OutDir)' != '' and !HasTrailingSlash('$(OutDir)')) was evaluated as ('Release\Win32\' != '' and !HasTrailingSlash('Release\Win32\')).
1>Task "Error" skipped, due to false condition; ('$(BaseIntermediateOutputPath)' != '' and !HasTrailingSlash('$(BaseIntermediateOutputPath)')) was evaluated as ('obj\' != '' and !HasTrailingSlash('obj\')).
1>Task "Error" skipped, due to false condition; ('$(IntermediateOutputPath)' != '' and !HasTrailingSlash('$(IntermediateOutputPath)')) was evaluated as ('Release\Win32\' != '' and !HasTrailingSlash('Release\Win32\')).
1>Done building target "_CheckForInvalidConfigurationAndPlatform" in project "K03_fcBase.vcxproj".: (TargetId:2)
1>Target "_DetermineManagedStateFromCL: (TargetId:3)" in file "C:\Programme\MSBuild\Microsoft.Cpp\v4.0\Microsoft.CppBuild.targets" from project "C:\_Arbeit\_Projekte\3-0009_Toaster\trunk\K03_fcBase\K03_fcBase.vcxproj" (target "GetTargetPath" depends on it):
1>Done building target "_DetermineManagedStateFromCL" in project "K03_fcBase.vcxproj".: (TargetId:3)
1>Target "GetTargetPath: (TargetId:4)" in file "C:\Programme\MSBuild\Microsoft.Cpp\v4.0\Microsoft.CppBuild.targets" from project "C:\_Arbeit\_Projekte\3-0009_Toaster\trunk\K03_fcBase\K03_fcBase.vcxproj" (entry point):
1>Done building target "GetTargetPath" in project "K03_fcBase.vcxproj".: (TargetId:4)
1>Done executing task "MSBuild". (TaskId:23)
1>Task "MSBuild" skipped, due to false condition; ('%(_MSBuildProjectReferenceExistent.BuildReference)' == 'true' and '@(ProjectReferenceWithConfiguration)' != '' and '$(BuildingInsideVisualStudio)' != 'true' and '$(BuildProjectReferences)' == 'true' and '@(_MSBuildProjectReferenceExistent)' != '') was evaluated as ('true' == 'true' and '..\K03_fcBase.vcxproj' != '' and 'true' != 'true' and 'true' == 'true' and '..\K03_fcBase.vcxproj' != '').
1>Task "MSBuild" (TaskId:24)
1> Global Properties: (TaskId:24)
1>    Configuration=Release (TaskId:24)
1>    Platform=Win32 (TaskId:24)
1>Building with tools version "4.0".
1>Target "_CheckForInvalidConfigurationAndPlatform" skipped. Previously built successfully.
1>Target "GetNativeManifest: (TargetId:5)" in file "C:\Programme\MSBuild\Microsoft.Cpp\v4.0\Microsoft.CppCommon.targets" from project "C:\_Arbeit\_Projekte\3-0009_Toaster\trunk\K03_fcBase\K03_fcBase.vcxproj" (entry point):
1>Done building target "GetNativeManifest" in project "K03_fcBase.vcxproj".: (TargetId:5)
1>Done executing task "MSBuild". (TaskId:24)
1>Task "Warning" skipped, due to false condition; ('@(ProjectReferenceWithConfiguration)' != '' and '@(_MSBuildProjectReferenceNonexistent)' != '') was evaluated as ('..\K03_fcBase.vcxproj' != '' and '' != '').
1>Done building target "ResolveProjectReferences" in project "Tests.vcxproj".: (TargetId:24)
1>Target "ResolveNativeReferences" skipped, due to false condition; ('@(NativeReference)'!='') was evaluated as (''!='').
1>Target "ResolveAssemblyReferences" skipped, due to false condition; ('@(Reference)'!='' or '@(_ResolvedProjectReferencePaths)'!='' or '@(_ExplicitReference)' != '') was evaluated as (''!='' or ''!='' or '' != '').
1>Target "ResolveComReferences" skipped, due to false condition; ('@(COMReference)'!='' or '@(COMFileReference)'!='') was evaluated as (''!='' or ''!='').
1>Target "AfterResolveReferences: (TargetId:25)" in file "c:\WINDOWS\Microsoft.NET\Framework\v4.0.30319\Microsoft.Common.Targets" from project "C:\_Arbeit\_Projekte\3-0009_Toaster\trunk\K03_fcBase\Tests\Tests.vcxproj" (target "ResolveReferences" depends on it):
1>Done building target "AfterResolveReferences" in project "Tests.vcxproj".: (TargetId:25)
1>Target "ResolveTestReferences" skipped, due to false condition; ('@(Shadow)'!='') was evaluated as (''!='').
1>Target "ResolveReferences: (TargetId:26)" in file "c:\WINDOWS\Microsoft.NET\Framework\v4.0.30319\Microsoft.Common.Targets" from project "C:\_Arbeit\_Projekte\3-0009_Toaster\trunk\K03_fcBase\Tests\Tests.vcxproj" (target "Build" depends on it):
1>Done building target "ResolveReferences" in project "Tests.vcxproj".: (TargetId:26)
1>Target "PlatformPrepareForBuild: (TargetId:27)" in file "C:\Programme\MSBuild\Microsoft.Cpp\v4.0\Platforms\Win32\Microsoft.Cpp.Win32.Targets" from project "C:\_Arbeit\_Projekte\3-0009_Toaster\trunk\K03_fcBase\Tests\Tests.vcxproj" (target "PrepareForBuild" depends on it):
1>Task "VCMessage" skipped, due to false condition; (!(exists('$(VCTargetsPath)\Platforms\Win32\PlatformToolsets\$(PlatformToolset)\Microsoft.Cpp.Win32.$(PlatformToolset).targets'))) was evaluated as (!(exists('C:\Programme\MSBuild\Microsoft.Cpp\v4.0\\Platforms\Win32\PlatformToolsets\v100\Microsoft.Cpp.Win32.v100.targets'))).
1>Done building target "PlatformPrepareForBuild" in project "Tests.vcxproj".: (TargetId:27)
1>Target "GetFrameworkPaths: (TargetId:28)" in file "c:\WINDOWS\Microsoft.NET\Framework\v4.0.30319\Microsoft.NETFramework.targets" from project "C:\_Arbeit\_Projekte\3-0009_Toaster\trunk\K03_fcBase\Tests\Tests.vcxproj" (target "PrepareForBuild" depends on it):
1>Done building target "GetFrameworkPaths" in project "Tests.vcxproj".: (TargetId:28)
1>Target "GetWinFXPath" skipped, due to false condition; (('@(Page)' != '' or '@(ApplicationDefinition)' != '' or '@(Resource)' != '') and ('$(GetWinFXNativePath)' != '' or '$(GetWinFXWoWPath)' != '' )) was evaluated as (('' != '' or '' != '' or '' != '') and ('' != '' or '' != '' )).
1>Target "GetReferenceAssemblyPaths: (TargetId:29)" in file "c:\WINDOWS\Microsoft.NET\Framework\v4.0.30319\Microsoft.Common.Targets" from project "C:\_Arbeit\_Projekte\3-0009_Toaster\trunk\K03_fcBase\Tests\Tests.vcxproj" (target "PrepareForBuild" depends on it):
1>Task "GetReferenceAssemblyPaths" skipped, due to false condition; ('$(TargetFrameworkMoniker)' != '' and ('$(_TargetFrameworkDirectories)' == '' or '$(_FullFrameworkReferenceAssemblyPaths)' == '')) was evaluated as ('.NETFramework,Version=v4.0' != '' and ('C:\Programme\Reference Assemblies\Microsoft\Framework\.NETFramework\v4.0' == '' or 'C:\Programme\Reference Assemblies\Microsoft\Framework\.NETFramework\v4.0' == '')).
1>Done building target "GetReferenceAssemblyPaths" in project "Tests.vcxproj".: (TargetId:29)
1>Target "PrepareForBuild: (TargetId:30)" in file "C:\Programme\MSBuild\Microsoft.Cpp\v4.0\Microsoft.CppBuild.targets" from project "C:\_Arbeit\_Projekte\3-0009_Toaster\trunk\K03_fcBase\Tests\Tests.vcxproj" (target "Build" depends on it):
1>Task "VCMessage" skipped, due to false condition; ('$(DesignTimeBuild)'!='true' and '$(ConfigurationPlatformExists)' != 'true') was evaluated as (''!='true' and 'true' != 'true').
1>Task "MakeDir" (TaskId:25)
1>Done executing task "MakeDir". (TaskId:25)
1>Task "VCMessage" skipped, due to false condition; ('$(DesignTimeBuild)'!='true' and '$(VCInstallDir)'=='' and '$(UseEnv)' != 'true' and ($(TargetFrameworkVersion)=='v3.5' or $(TargetFrameworkVersion)=='v3.0' or $(TargetFrameworkVersion)=='v2.0' )) was evaluated as (''!='true' and 'c:\Programme\Microsoft Visual Studio 10.0\VC\'=='' and '' != 'true' and (v4.0=='v3.5' or v4.0=='v3.0' or v4.0=='v2.0' )).
1>Task "VCMessage" skipped, due to false condition; ('$(DesignTimeBuild)'!='true' and '$(VCInstallDir)'=='' and '$(UseEnv)' != 'true' and '$(PlatformToolset)'=='v90') was evaluated as (''!='true' and 'c:\Programme\Microsoft Visual Studio 10.0\VC\'=='' and '' != 'true' and 'v100'=='v90').
1>Task "VCMessage" skipped, due to false condition; ('$(VCInstallDir)'=='' and '$(UseEnv)' != 'true') was evaluated as ('c:\Programme\Microsoft Visual Studio 10.0\VC\'=='' and '' != 'true').
1>Task "VCMessage" skipped, due to false condition; ('$(WindowsSDKDir)'=='' and '$(UseEnv)' != 'true') was evaluated as ('C:\Programme\Microsoft SDKs\Windows\v7.0A\'=='' and '' != 'true').
1>Task "VCMessage" skipped, due to false condition; ('$(IntDirTrailingSlashWarning)'=='true') was evaluated as (''=='true').
1>Task "VCMessage" skipped, due to false condition; ('$(OutDirTrailingSlashWarning)'=='true') was evaluated as (''=='true').
1>Task "MakeDir" (TaskId:26)
1>Done executing task "MakeDir". (TaskId:26)
1>Done building target "PrepareForBuild" in project "Tests.vcxproj".: (TargetId:30)
1>Target "PrepareForBuild" skipped. Previously built successfully.
1>Target "InitializeBuildStatus: (TargetId:31)" in file "C:\Programme\MSBuild\Microsoft.Cpp\v4.0\Microsoft.CppBuild.targets" from project "C:\_Arbeit\_Projekte\3-0009_Toaster\trunk\K03_fcBase\Tests\Tests.vcxproj" (target "Build" depends on it):
1>Task "ReadLinesFromFile" (TaskId:27)
1>Done executing task "ReadLinesFromFile". (TaskId:27)
1>Task "WriteLinesToFile" (TaskId:28)
1>Done executing task "WriteLinesToFile". (TaskId:28)
1>Using "Touch" task from assembly "Microsoft.Build.Tasks.v4.0, Version=4.0.0.0, Culture=neutral, PublicKeyToken=b03f5f7f11d50a3a".
1>Task "Touch" (TaskId:29)
1> Touching "Release\Win32\Tests.unsuccessfulbuild". (TaskId:29)
1>Done executing task "Touch". (TaskId:29)
1>Done building target "InitializeBuildStatus" in project "Tests.vcxproj".: (TargetId:31)
1>Target "AssignProjectConfiguration" skipped. Previously built successfully.
1>Target "_SplitProjectReferencesByFileExistence" skipped. Previously built successfully.
1>Target "BuildGenerateSourcesTraverse: (TargetId:32)" in file "c:\WINDOWS\Microsoft.NET\Framework\v4.0.30319\Microsoft.Common.Targets" from project "C:\_Arbeit\_Projekte\3-0009_Toaster\trunk\K03_fcBase\Tests\Tests.vcxproj" (target "BuildGenerateSources" depends on it):
1>Task "MSBuild" skipped, due to false condition; ('$(BuildPassReferences)' == 'true' and '@(ProjectReferenceWithConfiguration)' != '' and '@(_MSBuildProjectReferenceExistent)' != '' and '%(_MSBuildProjectReferenceExistent.BuildReference)' == 'true') was evaluated as ('' == 'true' and '..\K03_fcBase.vcxproj' != '' and '..\K03_fcBase.vcxproj' != '' and 'true' == 'true').
1>Done building target "BuildGenerateSourcesTraverse" in project "Tests.vcxproj".: (TargetId:32)
1>Target "SetBuildDefaultEnvironmentVariables" skipped. Previously built successfully.
1>Target "SetUserMacroEnvironmentVariables" skipped, due to false condition; ('@(BuildMacro)' != '') was evaluated as ('' != '').
1>Target "PrepareForBuild" skipped. Previously built successfully.
1>Target "ResolveReferences" skipped. Previously built successfully.
1>Target "BeforeBuildGenerateSources: (TargetId:33)" in file "C:\Programme\MSBuild\Microsoft.Cpp\v4.0\Microsoft.BuildSteps.Targets" from project "C:\_Arbeit\_Projekte\3-0009_Toaster\trunk\K03_fcBase\Tests\Tests.vcxproj" (target "BuildGenerateSources" depends on it):
1>Done building target "BeforeBuildGenerateSources" in project "Tests.vcxproj".: (TargetId:33)
1>Target "PreBuildEvent: (TargetId:34)" in file "C:\Programme\MSBuild\Microsoft.Cpp\v4.0\Microsoft.CppCommon.targets" from project "C:\_Arbeit\_Projekte\3-0009_Toaster\trunk\K03_fcBase\Tests\Tests.vcxproj" (target "BuildGenerateSources" depends on it):
1>Task "Message" skipped, due to false condition; ('%(PreBuildEvent.Message)' != '' and '%(PreBuildEvent.Command)' != '') was evaluated as ('' != '' and '' != '').
1>Task "Exec" skipped, due to false condition; ('%(PreBuildEvent.Command)' != '') was evaluated as ('' != '').
1>Done building target "PreBuildEvent" in project "Tests.vcxproj".: (TargetId:34)
1>Target "CustomBuild" skipped, due to false condition; ('@(CustomBuild)' != '') was evaluated as ('' != '').
1>Target "_GenerateXMLData: (TargetId:35)" in file "C:\Programme\MSBuild\Microsoft.Cpp\v4.0\Microsoft.CppBuild.targets" from project "C:\_Arbeit\_Projekte\3-0009_Toaster\trunk\K03_fcBase\Tests\Tests.vcxproj" (target "BuildGenerateSources" depends on it):
1>Done building target "_GenerateXMLData" in project "Tests.vcxproj".: (TargetId:35)
1>Target "_GenerateWebServiceProxy: (TargetId:36)" in file "C:\Programme\MSBuild\Microsoft.Cpp\v4.0\Microsoft.CppBuild.targets" from project "C:\_Arbeit\_Projekte\3-0009_Toaster\trunk\K03_fcBase\Tests\Tests.vcxproj" (target "BuildGenerateSources" depends on it):
1>Done building target "_GenerateWebServiceProxy" in project "Tests.vcxproj".: (TargetId:36)
1>Target "Xsd" skipped, due to false condition; ('@(Xsd)' != '') was evaluated as ('' != '').
1>Target "_Xsd: (TargetId:37)" in file "C:\Programme\MSBuild\Microsoft.Cpp\v4.0\Microsoft.CppBuild.targets" from project "C:\_Arbeit\_Projekte\3-0009_Toaster\trunk\K03_fcBase\Tests\Tests.vcxproj" (target "BuildGenerateSources" depends on it):
1>Done building target "_Xsd" in project "Tests.vcxproj".: (TargetId:37)
1>Target "MakeDirsForMidl: (TargetId:38)" in file "C:\Programme\MSBuild\Microsoft.Cpp\v4.0\Microsoft.CppBuild.targets" from project "C:\_Arbeit\_Projekte\3-0009_Toaster\trunk\K03_fcBase\Tests\Tests.vcxproj" (target "_Midl" depends on it):
1>Task "Makedir" (TaskId:30)
1>Done executing task "Makedir". (TaskId:30)
1>Done building target "MakeDirsForMidl" in project "Tests.vcxproj".: (TargetId:38)
1>Target "Midl" skipped, due to false condition; ('@(Midl)' != '') was evaluated as ('' != '').
1>Target "CustomBuild" skipped, due to false condition; ('@(CustomBuild)' != '') was evaluated as ('' != '').
1>Target "ComputeMIDLGeneratedCompileInputs: (TargetId:39)" in file "C:\Programme\MSBuild\Microsoft.Cpp\v4.0\Microsoft.CppBuild.targets" from project "C:\_Arbeit\_Projekte\3-0009_Toaster\trunk\K03_fcBase\Tests\Tests.vcxproj" (target "_Midl" depends on it):
1>Done building target "ComputeMIDLGeneratedCompileInputs" in project "Tests.vcxproj".: (TargetId:39)
1>Target "AfterMidl: (TargetId:40)" in file "C:\Programme\MSBuild\Microsoft.Cpp\v4.0\Microsoft.CppBuild.targets" from project "C:\_Arbeit\_Projekte\3-0009_Toaster\trunk\K03_fcBase\Tests\Tests.vcxproj" (target "_Midl" depends on it):
1>Done building target "AfterMidl" in project "Tests.vcxproj".: (TargetId:40)
1>Target "_Midl: (TargetId:41)" in file "C:\Programme\MSBuild\Microsoft.Cpp\v4.0\Microsoft.CppBuild.targets" from project "C:\_Arbeit\_Projekte\3-0009_Toaster\trunk\K03_fcBase\Tests\Tests.vcxproj" (target "BuildGenerateSources" depends on it):
1>Done building target "_Midl" in project "Tests.vcxproj".: (TargetId:41)
1>Target "AfterBuildGenerateSources: (TargetId:42)" in file "C:\Programme\MSBuild\Microsoft.Cpp\v4.0\Microsoft.BuildSteps.Targets" from project "C:\_Arbeit\_Projekte\3-0009_Toaster\trunk\K03_fcBase\Tests\Tests.vcxproj" (target "BuildGenerateSources" depends on it):
1>Done building target "AfterBuildGenerateSources" in project "Tests.vcxproj".: (TargetId:42)
1>Target "AfterBuildGenerateSourcesEvent: (TargetId:43)" in file "C:\Programme\MSBuild\Microsoft.Cpp\v4.0\Microsoft.CppBuild.targets" from project "C:\_Arbeit\_Projekte\3-0009_Toaster\trunk\K03_fcBase\Tests\Tests.vcxproj" (target "BuildGenerateSources" depends on it):
1>Done building target "AfterBuildGenerateSourcesEvent" in project "Tests.vcxproj".: (TargetId:43)
1>Target "BuildGenerateSources: (TargetId:44)" in file "c:\WINDOWS\Microsoft.NET\Framework\v4.0.30319\Microsoft.Common.Targets" from project "C:\_Arbeit\_Projekte\3-0009_Toaster\trunk\K03_fcBase\Tests\Tests.vcxproj" (target "Build" depends on it):
1>Done building target "BuildGenerateSources" in project "Tests.vcxproj".: (TargetId:44)
1>Target "AssignProjectConfiguration" skipped. Previously built successfully.
1>Target "_SplitProjectReferencesByFileExistence" skipped. Previously built successfully.
1>Target "BuildCompileTraverse: (TargetId:45)" in file "c:\WINDOWS\Microsoft.NET\Framework\v4.0.30319\Microsoft.Common.Targets" from project "C:\_Arbeit\_Projekte\3-0009_Toaster\trunk\K03_fcBase\Tests\Tests.vcxproj" (target "BuildCompile" depends on it):
1>Task "MSBuild" skipped, due to false condition; ('$(BuildPassReferences)' == 'true' and '@(ProjectReferenceWithConfiguration)' != '' and '@(_MSBuildProjectReferenceExistent)' != '' and '%(_MSBuildProjectReferenceExistent.BuildReference)' == 'true') was evaluated as ('' == 'true' and '..\K03_fcBase.vcxproj' != '' and '..\K03_fcBase.vcxproj' != '' and 'true' == 'true').
1>Done building target "BuildCompileTraverse" in project "Tests.vcxproj".: (TargetId:45)
1>Target "SetBuildDefaultEnvironmentVariables" skipped. Previously built successfully.
1>Target "SetUserMacroEnvironmentVariables" skipped, due to false condition; ('@(BuildMacro)' != '') was evaluated as ('' != '').
1>Target "PrepareForBuild" skipped. Previously built successfully.
1>Target "ResolveReferences" skipped. Previously built successfully.
1>Target "BeforeClCompile: (TargetId:46)" in file "C:\Programme\MSBuild\Microsoft.Cpp\v4.0\Microsoft.CppBuild.targets" from project "C:\_Arbeit\_Projekte\3-0009_Toaster\trunk\K03_fcBase\Tests\Tests.vcxproj" (target "_ClCompile" depends on it):
1>Done building target "BeforeClCompile" in project "Tests.vcxproj".: (TargetId:46)
1>Target "ComputeMIDLGeneratedCompileInputs" skipped. Previously built successfully.
1>Target "ComputeCLInputPDBName: (TargetId:47)" in file "C:\Programme\MSBuild\Microsoft.Cpp\v4.0\Microsoft.CppBuild.targets" from project "C:\_Arbeit\_Projekte\3-0009_Toaster\trunk\K03_fcBase\Tests\Tests.vcxproj" (target "_ClCompile" depends on it):
1>Done building target "ComputeCLInputPDBName" in project "Tests.vcxproj".: (TargetId:47)
1>Target "ResolveReferences" skipped. Previously built successfully.
1>Target "ComputeReferenceCLInput: (TargetId:48)" in file "C:\Programme\MSBuild\Microsoft.Cpp\v4.0\Microsoft.CppBuild.targets" from project "C:\_Arbeit\_Projekte\3-0009_Toaster\trunk\K03_fcBase\Tests\Tests.vcxproj" (target "_ClCompile" depends on it):
1>Task "WriteLinesToFile" (TaskId:31)
1>Done executing task "WriteLinesToFile". (TaskId:31)
1>Task "Message" skipped, due to false condition; ('$(_REFERENCE_DEBUG)'=='true' and '%(ClCompile.CompileAsManaged)' != 'false' and '%(ClCompile.CompileAsManaged)' != '') was evaluated as (''=='true' and '' != 'false' and '' != '').
1>Done building target "ComputeReferenceCLInput" in project "Tests.vcxproj".: (TargetId:48)
1>Target "MakeDirsForCl: (TargetId:49)" in file "C:\Programme\MSBuild\Microsoft.Cpp\v4.0\Microsoft.CppBuild.targets" from project "C:\_Arbeit\_Projekte\3-0009_Toaster\trunk\K03_fcBase\Tests\Tests.vcxproj" (target "_ClCompile" depends on it):
1>Task "MakeDir" (TaskId:32)
1>Done executing task "MakeDir". (TaskId:32)
1>Done building target "MakeDirsForCl" in project "Tests.vcxproj".: (TargetId:49)
1>Target "PrepareForBuild" skipped. Previously built successfully.
1>Target "SetBuildDefaultEnvironmentVariables" skipped. Previously built successfully.
1>Target "SetUserMacroEnvironmentVariables" skipped, due to false condition; ('@(BuildMacro)' != '') was evaluated as ('' != '').
1>Target "_SelectedFiles: (TargetId:50)" in file "C:\Programme\MSBuild\Microsoft.Cpp\v4.0\Microsoft.CppBuild.targets" from project "C:\_Arbeit\_Projekte\3-0009_Toaster\trunk\K03_fcBase\Tests\Tests.vcxproj" (target "SelectClCompile" depends on it):
1>Done building target "_SelectedFiles" in project "Tests.vcxproj".: (TargetId:50)
1>Target "ComputeMIDLGeneratedCompileInputs" skipped. Previously built successfully.
1>Target "ComputeCLInputPDBName" skipped. Previously built successfully.
1>Target "ComputeReferenceCLInput" skipped. Previously built successfully.
1>Target "_SelectedFiles" skipped. Previously built successfully.
1>Target "SelectCustomBuild: (TargetId:51)" in file "C:\Programme\MSBuild\Microsoft.Cpp\v4.0\Microsoft.CppBuild.targets" from project "C:\_Arbeit\_Projekte\3-0009_Toaster\trunk\K03_fcBase\Tests\Tests.vcxproj" (target "SelectClCompile" depends on it):
1>Done building target "SelectCustomBuild" in project "Tests.vcxproj".: (TargetId:51)
1>Target "SelectClCompile: (TargetId:52)" in file "C:\Programme\MSBuild\Microsoft.Cpp\v4.0\Microsoft.CppBuild.targets" from project "C:\_Arbeit\_Projekte\3-0009_Toaster\trunk\K03_fcBase\Tests\Tests.vcxproj" (target "ClCompile" depends on it):
1>Done building target "SelectClCompile" in project "Tests.vcxproj".: (TargetId:52)
1>Target "GenerateTargetFrameworkMonikerAttribute" skipped, due to false condition; ('$(GenerateTargetFrameworkAttribute)' == 'true') was evaluated as ('false' == 'true').
1>Target "ClCompile: (TargetId:53)" in file "C:\Programme\MSBuild\Microsoft.Cpp\v4.0\Platforms\Win32\Microsoft.Cpp.Win32.Targets" from project "C:\_Arbeit\_Projekte\3-0009_Toaster\trunk\K03_fcBase\Tests\Tests.vcxproj" (target "_ClCompile" depends on it):
1>Task "Delete" (TaskId:33)
1> File "Release\Win32\Tests.pch" doesn't exist. Skipping. (TaskId:33)
1>Done executing task "Delete". (TaskId:33)
1>Task "Delete" (TaskId:34)
1>Done executing task "Delete". (TaskId:34)
1>Task "CL" skipped, due to false condition; ('%(ClCompile.PrecompiledHeader)' == 'Create' and '%(ClCompile.ExcludedFromBuild)'!='true') was evaluated as ('Use' == 'Create' and ''!='true').
1>Using "CL" task from assembly "Microsoft.Build.CppTasks.Win32, Version=4.0.0.0, Culture=neutral, PublicKeyToken=b03f5f7f11d50a3a".
1>Task "CL" (TaskId:35)
1> Environment Variables passed to tool: (TaskId:35)
1>    VS_UNICODE_OUTPUT=700 (TaskId:35)
1> Tracking command: (TaskId:35)
1> C:\Programme\Microsoft SDKs\Windows\v7.0A\bin\NETFX 4.0 Tools\Tracker.exe /d C:\WINDOWS\Microsoft.NET\Framework\v4.0.30319\FileTracker.dll /i C:\_Arbeit\_Projekte\3-0009_Toaster\trunk\K03_fcBase\Tests\Release\Win32 /r C:\_ARBEIT\_PROJEKTE\3-0009_Toaster\TRUNK\K03_FCBASE\TESTS\STDAFX.CPP /b MSBuildConsole_CancelEvent0bc97a4f172843cf91e699e7dc74ad6c /c "c:\Programme\Microsoft Visual Studio 10.0\VC\bin\CL.exe" /c /I..\ /I.\cppunit\include /I..\fcBase_API_headers\Public /I..\fcBase_API_headers\Internal /Zi /nologo /W4 /WX- /O2 /Oy- /D WIN32 /D _WINDOWS /D NDEBUG /D _MBCS /D _AFXDLL /Gm- /EHsc /MD /GS /fp:precise /Zc:wchar_t /Zc:forScope /Yc"StdAfx.h" /Fp"Release\Win32\Tests.pch" /Fo"Release\Win32\\" /Fd"Release\Win32\vc100.pdb" /Gd /TP /analyze- /errorReport:prompt stdafx.cpp (TaskId:35)
1> stdafx.cpp (TaskId:35)
1>c:\Programme\Microsoft Visual Studio 10.0\VC\atlmfc\include\atltransactionmanager.h(262): error C3861: 'AtlLoadSystemLibraryUsingFullPath': identifier not found
1>c:\Programme\Microsoft Visual Studio 10.0\VC\atlmfc\include\atltransactionmanager.h(312): error C3861: 'AtlLoadSystemLibraryUsingFullPath': identifier not found
1>c:\Programme\Microsoft Visual Studio 10.0\VC\atlmfc\include\atltransactionmanager.h(342): error C3861: 'AtlLoadSystemLibraryUsingFullPath': identifier not found
1> The command exited with code 2. (TaskId:35)
1>Done executing task "CL" -- FAILED. (TaskId:35)
1>Done building target "ClCompile" in project "Tests.vcxproj" -- FAILED.: (TargetId:53)
1>
1>Project Performance Summary:
1>     78 ms C:\_Arbeit\_Projekte\3-0009_Toaster\trunk\K03_fcBase\K03_fcBase.vcxproj 2 calls
1>                 78 ms GetTargetPath                             1 calls
1>                 0 ms GetNativeManifest                         1 calls
1>     3482 ms C:\_Arbeit\_Projekte\3-0009_Toaster\trunk\K03_fcBase\Tests\Tests.vcxproj 1 calls
1>             3482 ms rebuild                                    1 calls
1>
1>Target Performance Summary:
1>        0 ms ComputeCLInputPDBName                     1 calls
1>        0 ms _PrepareForBuild                         1 calls
1>        0 ms _SplitProjectReferencesByFileExistence     1 calls
1>        0 ms _SelectedFiles                             1 calls
1>        0 ms BeforeClean                                1 calls
1>        0 ms AfterCppClean                             1 calls
1>        0 ms _Xsd                                     1 calls
1>        0 ms BuildGenerateSources                     1 calls
1>        0 ms PGInstrumentedClean                        1 calls
1>        0 ms InitializeBuildStatus                     1 calls
1>        0 ms BuildGenerateSourcesTraverse             1 calls
1>        0 ms _GenerateXMLData                         1 calls
1>        0 ms _Midl                                     1 calls
1>        0 ms _GenerateWebServiceProxy                 1 calls
1>        0 ms AfterResolveReferences                     1 calls
1>        0 ms PlatformPrepareForBuild                    1 calls
1>        0 ms ComputeReferenceCLInput                    1 calls
1>        0 ms GetFrameworkPaths                         1 calls
1>        0 ms Clean                                     1 calls
1>        0 ms BuildCompileTraverse                     1 calls
1>        0 ms BeforeRebuild                             1 calls
1>        0 ms MakeDirsForMidl                            1 calls
1>        0 ms CleanPublishFolder                         1 calls
1>        0 ms GetReferenceAssemblyPaths                 1 calls
1>        0 ms CleanReferencedProjects                    1 calls
1>        0 ms _PrepareForRebuild                         1 calls
1>        0 ms _DetermineManagedStateFromCL             2 calls
1>        0 ms SelectClCompile                            1 calls
1>        0 ms BeforeBuildGenerateSources                 1 calls
1>        0 ms SetBuildDefaultEnvironmentVariables        1 calls
1>        0 ms _PrepareForClean                         1 calls
1>        0 ms BeforeClCompile                            1 calls
1>        0 ms BeforeResolveReferences                    1 calls
1>        0 ms AfterBuildGenerateSources                 1 calls
1>        0 ms AfterClean                                 1 calls
1>        0 ms PreBuildEvent                             1 calls
1>        0 ms CoreClean                                 1 calls
1>        0 ms _RemoveNameMetadataFromProjectReferenceItems 1 calls
1>        0 ms SelectCustomBuild                         1 calls
1>        0 ms GetNativeManifest                         1 calls
1>        0 ms AfterMidl                                 1 calls
1>        0 ms CppClean                                 1 calls
1>        0 ms BeforeCppClean                             1 calls
1>        0 ms AfterBuildGenerateSourcesEvent             1 calls
1>        0 ms PrepareForBuild                            1 calls
1>        0 ms ResolveReferences                         1 calls
1>        0 ms ComputeMIDLGeneratedCompileInputs         1 calls
1>     16 ms GetTargetPath                             1 calls
1>     47 ms AssignProjectConfiguration                 1 calls
1>     47 ms CoreCppClean                             1 calls
1>     78 ms MakeDirsForCl                             1 calls
1>     156 ms _CheckForInvalidConfigurationAndPlatform 2 calls
1>     281 ms ResolveProjectReferences                 1 calls
1>     2919 ms ClCompile                                 1 calls
1>
1>Task Performance Summary:
1>        0 ms Touch                                     1 calls
1>        0 ms MakeDir                                    6 calls
1>        0 ms ResolveNonMSBuildProjectOutput             1 calls
1>        0 ms SetEnv                                     4 calls
1>        0 ms ReadLinesFromFile                         2 calls
1>        0 ms RemoveDuplicates                         1 calls
1>        0 ms Message                                    4 calls
1>        0 ms Delete                                     6 calls
1>        0 ms FindUnderPath                             2 calls
1>     16 ms CppClean                                 1 calls
1>     16 ms WriteLinesToFile                         4 calls
1>     47 ms AssignProjectConfiguration                 1 calls
1>     281 ms MSBuild                                    2 calls
1>     2857 ms CL                                         1 calls
1>
1>Build FAILED.
1>
1>Time Elapsed 00:00:03.37
========== Rebuild All: 0 succeeded, 1 failed, 0 skipped ==========



Windows Prof XP3 German


Microsoft Visual Studio 2010 (English)
Version 10.0.30319.1 RTMRel
Microsoft .NET Framework
Version 4.0.30319 RTMRel

Installed Version: Professional

Microsoft Office Developer Tools 01018-532-2002102-70099
Microsoft Office Developer Tools

Microsoft Visual Basic 2010 01018-532-2002102-70099
Microsoft Visual Basic 2010

Microsoft Visual C# 2010 01018-532-2002102-70099
Microsoft Visual C# 2010

Microsoft Visual C++ 2010 01018-532-2002102-70099
Microsoft Visual C++ 2010

Microsoft Visual F# 2010 01018-532-2002102-70099
Microsoft Visual F# 2010

Microsoft Visual Studio 2010 Team Explorer 01018-532-2002102-70099
Microsoft Visual Studio 2010 Team Explorer

Microsoft Visual Web Developer 2010 01018-532-2002102-70099
Microsoft Visual Web Developer 2010

AnkhSVN - Subversion Support for Visual Studio 2.1.8420.8
AnkhSVN - Subversion Support for Visual Studio 2.1.8420.8
* Ankh.Package 2.1.8420.8
* Subversion 1.6.11 via SharpSvn 1.6011.1539.9366

SharpSvn is linked to: Apr 1.3.12, Apr-util 1.3.9, Neon 0.29.3, OpenSSL 1.0.0 29 Mar 2010, serf 0.3.1, SQLite 3.6.23, Subversion 1.6.11-SharpSvn-tag-1.6.11@936627, ZLib 1.2.4
SharpSvn is dynamically linked to: Cyrus Sasl 2.1.23
SharpSvn is optionally linked to: Berkeley DB 4.4.20, SharpPlink 1.6011.1539.9366

Crystal Reports Templates for Microsoft Visual Studio 2010
Crystal Reports Templates for Microsoft Visual Studio 2010

GhostDoc 2.5.9166.0
GhostDoc - Visual Studio add-in for automatically creating XML documentation comments.

Hotfix for Microsoft Visual Studio 2010 Professional - ENU (KB2280741) KB2280741
This hotfix is for Microsoft Visual Studio 2010 Professional - ENU.
If you later install a more recent service pack, this hotfix will be uninstalled automatically.
For more information, visit http://support.microsoft.com/kb/2280741.

Hotfix for Microsoft Visual Studio 2010 Professional - ENU (KB2455033) KB2455033
This hotfix is for Microsoft Visual Studio 2010 Professional - ENU.
If you later install a more recent service pack, this hotfix will be uninstalled automatically.
For more information, visit http://support.microsoft.com/kb/2455033.

Microsoft Visual Studio 2010 SharePoint Developer Tools 10.0.30319
Microsoft Visual Studio 2010 SharePoint Developer Tools
Posted by Mark McGinty on 10/7/2011 at 8:08 AM
Closed as not reproducible? That's BS! If MS had to pay even $10/hour for all the man-hours it effectively squanders via neglect, carelessness and/or laziness, it would go bankrupt in a matter of months.
Posted by tibb on 8/25/2011 at 2:37 AM
This function is missing after updating in C:\Program Files (x86)\Microsoft Visual Studio 10.0\VC\atlmfc\include\atlcore.h file:


//////////////////////////////////////////////////////////////////////////////
// DLL Load Helper

inline HMODULE AtlLoadSystemLibraryUsingFullPath(_In_z_ const WCHAR *pszLibrary)
{
    WCHAR wszLoadPath[MAX_PATH+1];
    if (::GetSystemDirectoryW(wszLoadPath, _countof(wszLoadPath)) == 0)
    {
        return NULL;
    }

    if (wszLoadPath[wcslen(wszLoadPath)-1] != L'\\')
    {
        if (wcscat_s(wszLoadPath, _countof(wszLoadPath), L"\\") != 0)
        {
            return NULL;
        }
    }

    if (wcscat_s(wszLoadPath, _countof(wszLoadPath), pszLibrary) != 0)
    {
        return NULL;
    }

    return(::LoadLibraryW(wszLoadPath));
}

//////////////////////////////////////////////////////////////////////////////
Posted by Clint Goudie-Nice on 8/11/2011 at 9:05 AM
Greetings. Following windows updates that were applied to my x64 machine last night, it appears that my atltransactionmanager.h was replaced with a version that on line 262 contains:
HMODULE hKTM32 = AtlLoadSystemLibraryUsingFullPath(L"ktmw32.dll");

That function is not defined in atlcore.h and now my c++ projects will not compile.

If I open the previous version of this file, on line 262 I see:
HMODULE hKTM32 = LoadLibraryW(L"ktmw32.dll");

Please fix this update with some haste.
Posted by gerritvn on 6/15/2011 at 12:54 AM
Here is more detail on the problem:

On a Win7 32 bit system C:\Program Files\Microsoft Visual Studio 10.0\VC\atlmfc\include\atlcore.h is dated 2010-12-21 and contains the required definition.
On a Win7 64 bit system C:\Program Files (x86)\Microsoft Visual Studio 10.0\VC\atlmfc\include\atlcore.h is dated 2011-02-10 and lacks the required definition.

Now please go and fix the update that probably caused many man-hours to be wasted all over the world.

Posted by Peter Rudloff on 5/15/2011 at 4:42 AM
Unfortunately, I neither have VS2008 installed nor a atlcore.h from another machine. Hence, the two workarounds offered didn't help. I assume, the error could be related to a windows update since my project code had not changed before it was compiled to debug a procedure and the error occured.
Posted by Haugen72 on 5/13/2011 at 12:47 AM
Hi,

I am experiencing the same problem when porting a 2003 solution to VS 2010 C++.
It is a small dialog based app with a few source files so I thought a quick work-around could be to generate a new dialog based solution with the 2010 wizard and then move the source code from the old project to the new wizard generated 2010 project.
I was quite surprised to find out that the unmodified wizard generated dialog based app have the exact same problem!

Below is the build log that has been requested earlier in this thread
Hope to have a solution soon.
Best regards,
Haugen72

====================================================
1>------ Rebuild All started: Project: PackEditor2, Configuration: Debug Win32 ------
1>Build started 13-05-2011 09:43:16.
1>Environment at start of build:
1>MSBuildExtensionsPath32 = C:\Program Files\MSBuild
1>MSBuildExtensionsPath = C:\Program Files\MSBuild
1>LOCALAPPDATA = C:\Users\ph\AppData\Local
1>ALLUSERSPROFILE = C:\ProgramData
1>APPDATA = C:\Users\ph\AppData\Roaming
1>CLASSPATH = .;C:\Program Files\Java\jre6\lib\ext\QTJava.zip
1>CommonProgramFiles = C:\Program Files\Common Files
1>COMPUTERNAME = HAUGE
1>ComSpec = C:\Windows\system32\cmd.exe
1>FP_NO_HOST_CHECK = NO
1>HOMEDRIVE = C:
1>HOMEPATH = \Users\ph
1>ICPP_COMPILER12 = C:\Program Files\Intel\ComposerXE-2011\
1>INTEL_LICENSE_FILE = C:\Program Files\Common Files\Intel\Licenses
1>LOGONSERVER = \\HAUGE
1>NUMBER_OF_PROCESSORS = 2
1>OS = Windows_NT
1>Path = D:\Perforce\3rdParty\Intel\IPP\redist\ia32;C:\Program Files\Intel\ComposerXE-2011\redist\ia32\ipp;C:\Program Files\Common Files\Microsoft Shared\Windows Live;C:\Windows\system32;C:\Windows;C:\Windows\System32\Wbem;C:\Windows\System32\WindowsPowerShell\v1.0\;c:\Program Files\Microsoft SQL Server\100\Tools\Binn\;c:\Program Files\Microsoft SQL Server\100\DTS\Binn\;C:\Program Files\Perforce;C:\Program Files\Windows Live\Shared;d:\perforce\3rdParty\Microsoft;;C:\Program Files\WinMerge;d:\perforce\trivision\bin;d:\perforce\trivision\bin\debug;D:\Perforce\3rdParty\Microsoft\VC71;K:\MsVc71;D:\Perforce\3rdParty\VTK\bin;d:\perforce\3rdparty\qt\qt\bin;D:\Perforce\3rdParty\AVT\FirePackage2V11\UniAPI\Lib;D:\Perforce\3rdParty\AVT\FirePackage2V11\FireGrab\Lib;C:\Program Files\MySQL\MySQL Server 5.1\bin;C:\Program Files\QuickTime\QTSystem\
1>PATHEXT = .COM;.EXE;.BAT;.CMD;.VBS;.VBE;.JS;.JSE;.WSF;.WSH;.MSC
1>PROCESSOR_ARCHITECTURE = x86
1>PROCESSOR_IDENTIFIER = x86 Family 6 Model 15 Stepping 10, GenuineIntel
1>PROCESSOR_LEVEL = 6
1>PROCESSOR_REVISION = 0f0a
1>ProgramData = C:\ProgramData
1>ProgramFiles = C:\Program Files
1>PSModulePath = C:\Windows\system32\WindowsPowerShell\v1.0\Modules\
1>PUBLIC = C:\Users\Public
1>QTJAVA = C:\Program Files\Java\jre6\lib\ext\QTJava.zip
1>SESSIONNAME = Console
1>SystemDrive = C:
1>SystemRoot = C:\Windows
1>TEMP = C:\Users\ph\AppData\Local\Temp
1>TMP = C:\Users\ph\AppData\Local\Temp
1>USERDOMAIN = hauge
1>USERNAME = ph
1>USERPROFILE = C:\Users\ph
1>VBOX_INSTALL_PATH = C:\Program Files\Oracle\VirtualBox\
1>VisualStudioDir = C:\Users\ph\Documents\Visual Studio 2010
1>VS100COMNTOOLS = C:\Program Files\Microsoft Visual Studio 10.0\Common7\Tools\
1>windir = C:\Windows
1>WISECore39 = C:\Program Files\Saab\WISE Connectivity 3.9\
1>
1>Building with tools version "4.0".
1>Target "_CheckForInvalidConfigurationAndPlatform: (TargetId:2)" in file "C:\Windows\Microsoft.NET\Framework\v4.0.30319\Microsoft.Common.Targets" from project "D:\Perforce\Projects\PE2\PackEditor2\PackEditor2\PackEditor2.vcxproj" (entry point):
1>Task "Error" skipped, due to false condition; ( '$(_InvalidConfigurationError)' == 'true' ) was evaluated as ( '' == 'true' ).
1>Task "Warning" skipped, due to false condition; ( '$(_InvalidConfigurationWarning)' == 'true' ) was evaluated as ( '' == 'true' ).
1>Using "Message" task from assembly "Microsoft.Build.Tasks.v4.0, Version=4.0.0.0, Culture=neutral, PublicKeyToken=b03f5f7f11d50a3a".
1>Task "Message" (TaskId:2)
1> Configuration=Debug (TaskId:2)
1>Done executing task "Message". (TaskId:2)
1>Task "Message" (TaskId:3)
1> Platform=Win32 (TaskId:3)
1>Done executing task "Message". (TaskId:3)
1>Task "Error" skipped, due to false condition; ('$(OutDir)' != '' and !HasTrailingSlash('$(OutDir)')) was evaluated as ('D:\Perforce\Projects\PE2\PackEditor2\Debug\' != '' and !HasTrailingSlash('D:\Perforce\Projects\PE2\PackEditor2\Debug\')).
1>Task "Error" skipped, due to false condition; ('$(BaseIntermediateOutputPath)' != '' and !HasTrailingSlash('$(BaseIntermediateOutputPath)')) was evaluated as ('obj\' != '' and !HasTrailingSlash('obj\')).
1>Task "Error" skipped, due to false condition; ('$(IntermediateOutputPath)' != '' and !HasTrailingSlash('$(IntermediateOutputPath)')) was evaluated as ('Debug\' != '' and !HasTrailingSlash('Debug\')).
1>Done building target "_CheckForInvalidConfigurationAndPlatform" in project "PackEditor2.vcxproj".: (TargetId:2)
1>Target "_DetermineManagedStateFromCL: (TargetId:3)" in file "C:\Program Files\MSBuild\Microsoft.Cpp\v4.0\Microsoft.CppBuild.targets" from project "D:\Perforce\Projects\PE2\PackEditor2\PackEditor2\PackEditor2.vcxproj" (target "Rebuild" depends on it):
1>Done building target "_DetermineManagedStateFromCL" in project "PackEditor2.vcxproj".: (TargetId:3)
1>Target "_PrepareForRebuild: (TargetId:4)" in file "C:\Program Files\MSBuild\Microsoft.Cpp\v4.0\Microsoft.BuildSteps.Targets" from project "D:\Perforce\Projects\PE2\PackEditor2\PackEditor2\PackEditor2.vcxproj" (target "Rebuild" depends on it):
1>Done building target "_PrepareForRebuild" in project "PackEditor2.vcxproj".: (TargetId:4)
1>Target "BeforeRebuild: (TargetId:5)" in file "C:\Windows\Microsoft.NET\Framework\v4.0.30319\Microsoft.Common.Targets" from project "D:\Perforce\Projects\PE2\PackEditor2\PackEditor2\PackEditor2.vcxproj" (target "Rebuild" depends on it):
1>Done building target "BeforeRebuild" in project "PackEditor2.vcxproj".: (TargetId:5)
1>Target "_PrepareForClean: (TargetId:6)" in file "C:\Program Files\MSBuild\Microsoft.Cpp\v4.0\Microsoft.BuildSteps.Targets" from project "D:\Perforce\Projects\PE2\PackEditor2\PackEditor2\PackEditor2.vcxproj" (target "Clean" depends on it):
1>Using "Delete" task from assembly "Microsoft.Build.Tasks.v4.0, Version=4.0.0.0, Culture=neutral, PublicKeyToken=b03f5f7f11d50a3a".
1>Task "Delete" (TaskId:4)
1> Deleting file "Debug\PackEditor2.lastbuildstate". (TaskId:4)
1>Done executing task "Delete". (TaskId:4)
1>Done building target "_PrepareForClean" in project "PackEditor2.vcxproj".: (TargetId:6)
1>Target "BeforeClean: (TargetId:7)" in file "C:\Windows\Microsoft.NET\Framework\v4.0.30319\Microsoft.Common.Targets" from project "D:\Perforce\Projects\PE2\PackEditor2\PackEditor2\PackEditor2.vcxproj" (target "Clean" depends on it):
1>Done building target "BeforeClean" in project "PackEditor2.vcxproj".: (TargetId:7)
1>Target "UnmanagedUnregistration" skipped, due to false condition; ((('$(_AssemblyTimestampBeforeCompile)' != '$(_AssemblyTimestampAfterCompile)' or '$(RegisterForComInterop)' != 'true' or '$(OutputType)' != 'library') or
1>                    ('$(_AssemblyTimestampBeforeCompile)' == '')) and
1>                 Exists('@(_UnmanagedRegistrationCache)')) was evaluated as ((('' != '' or '' != 'true' or 'exe' != 'library') or
1>                    ('' == '')) and
1>                 Exists('obj\PackEditor2.vcxproj.UnmanagedRegistration.cache')).
1>Target "CoreClean: (TargetId:8)" in file "C:\Windows\Microsoft.NET\Framework\v4.0.30319\Microsoft.Common.Targets" from project "D:\Perforce\Projects\PE2\PackEditor2\PackEditor2\PackEditor2.vcxproj" (target "Clean" depends on it):
1>Task "Delete" (TaskId:5)
1>Done executing task "Delete". (TaskId:5)
1>Using "ReadLinesFromFile" task from assembly "Microsoft.Build.Tasks.v4.0, Version=4.0.0.0, Culture=neutral, PublicKeyToken=b03f5f7f11d50a3a".
1>Task "ReadLinesFromFile" (TaskId:6)
1>Done executing task "ReadLinesFromFile". (TaskId:6)
1>Using "FindUnderPath" task from assembly "Microsoft.Build.Tasks.v4.0, Version=4.0.0.0, Culture=neutral, PublicKeyToken=b03f5f7f11d50a3a".
1>Task "FindUnderPath" (TaskId:7)
1> Comparison path is "D:\Perforce\Projects\PE2\PackEditor2\Debug\". (TaskId:7)
1>Done executing task "FindUnderPath". (TaskId:7)
1>Task "FindUnderPath" (TaskId:8)
1> Comparison path is "Debug\". (TaskId:8)
1>Done executing task "FindUnderPath". (TaskId:8)
1>Task "Delete" (TaskId:9)
1>Done executing task "Delete". (TaskId:9)
1>Using "RemoveDuplicates" task from assembly "Microsoft.Build.Tasks.v4.0, Version=4.0.0.0, Culture=neutral, PublicKeyToken=b03f5f7f11d50a3a".
1>Task "RemoveDuplicates" (TaskId:10)
1>Done executing task "RemoveDuplicates". (TaskId:10)
1>Using "MakeDir" task from assembly "Microsoft.Build.Tasks.v4.0, Version=4.0.0.0, Culture=neutral, PublicKeyToken=b03f5f7f11d50a3a".
1>Task "MakeDir" (TaskId:11)
1>Done executing task "MakeDir". (TaskId:11)
1>Using "WriteLinesToFile" task from assembly "Microsoft.Build.Tasks.v4.0, Version=4.0.0.0, Culture=neutral, PublicKeyToken=b03f5f7f11d50a3a".
1>Task "WriteLinesToFile" (TaskId:12)
1>Done executing task "WriteLinesToFile". (TaskId:12)
1>Done building target "CoreClean" in project "PackEditor2.vcxproj".: (TargetId:8)
1>Target "AssignProjectConfiguration" skipped, due to false condition; ('@(ProjectReference)'!='') was evaluated as (''!='').
1>Target "_SplitProjectReferencesByFileExistence: (TargetId:9)" in file "C:\Windows\Microsoft.NET\Framework\v4.0.30319\Microsoft.Common.Targets" from project "D:\Perforce\Projects\PE2\PackEditor2\PackEditor2\PackEditor2.vcxproj" (target "CleanReferencedProjects" depends on it):
1>Task "ResolveNonMSBuildProjectOutput" skipped, due to false condition; ('$(BuildingInsideVisualStudio)'=='true' and '@(ProjectReferenceWithConfiguration)'!='') was evaluated as ('true'=='true' and ''!='').
1>Done building target "_SplitProjectReferencesByFileExistence" in project "PackEditor2.vcxproj".: (TargetId:9)
1>Target "CleanReferencedProjects: (TargetId:10)" in file "C:\Windows\Microsoft.NET\Framework\v4.0.30319\Microsoft.Common.Targets" from project "D:\Perforce\Projects\PE2\PackEditor2\PackEditor2\PackEditor2.vcxproj" (target "Clean" depends on it):
1>Task "MSBuild" skipped, due to false condition; ('$(BuildingInsideVisualStudio)' != 'true' and '$(BuildProjectReferences)' == 'true' and '@(_MSBuildProjectReferenceExistent)' != '') was evaluated as ('true' != 'true' and 'true' == 'true' and '' != '').
1>Done building target "CleanReferencedProjects" in project "PackEditor2.vcxproj".: (TargetId:10)
1>Target "CleanPublishFolder: (TargetId:11)" in file "C:\Windows\Microsoft.NET\Framework\v4.0.30319\Microsoft.Common.Targets" from project "D:\Perforce\Projects\PE2\PackEditor2\PackEditor2\PackEditor2.vcxproj" (target "Clean" depends on it):
1>Task "RemoveDir" skipped, due to false condition; ('$(PublishDir)'=='$(OutputPath)app.publish\' and Exists('$(PublishDir)')) was evaluated as ('D:\Perforce\Projects\PE2\PackEditor2\Debug\app.publish\'=='D:\Perforce\Projects\PE2\PackEditor2\Debug\app.publish\' and Exists('D:\Perforce\Projects\PE2\PackEditor2\Debug\app.publish\')).
1>Done building target "CleanPublishFolder" in project "PackEditor2.vcxproj".: (TargetId:11)
1>Target "AfterClean: (TargetId:12)" in file "C:\Windows\Microsoft.NET\Framework\v4.0.30319\Microsoft.Common.Targets" from project "D:\Perforce\Projects\PE2\PackEditor2\PackEditor2\PackEditor2.vcxproj" (target "Clean" depends on it):
1>Done building target "AfterClean" in project "PackEditor2.vcxproj".: (TargetId:12)
1>Target "EntityClean" skipped, due to false condition; ('@(EntityDeploy)' != '') was evaluated as ('' != '').
1>Target "BeforeCppClean: (TargetId:13)" in file "C:\Program Files\MSBuild\Microsoft.Cpp\v4.0\Microsoft.CppClean.targets" from project "D:\Perforce\Projects\PE2\PackEditor2\PackEditor2\PackEditor2.vcxproj" (target "CppClean" depends on it):
1>Done building target "BeforeCppClean" in project "PackEditor2.vcxproj".: (TargetId:13)
1>Target "CoreCppClean: (TargetId:14)" in file "C:\Program Files\MSBuild\Microsoft.Cpp\v4.0\Microsoft.CppClean.targets" from project "D:\Perforce\Projects\PE2\PackEditor2\PackEditor2\PackEditor2.vcxproj" (target "CppClean" depends on it):
1>Task "MakeDir" (TaskId:13)
1>Done executing task "MakeDir". (TaskId:13)
1>Using "CppClean" task from assembly "Microsoft.Build.CppTasks.Common, Version=4.0.0.0, Culture=neutral, PublicKeyToken=b03f5f7f11d50a3a".
1>Task "CppClean" (TaskId:14)
1>Done executing task "CppClean". (TaskId:14)
1>Task "WriteLinesToFile" (TaskId:15)
1>Done executing task "WriteLinesToFile". (TaskId:15)
1>Done building target "CoreCppClean" in project "PackEditor2.vcxproj".: (TargetId:14)
1>Target "AfterCppClean: (TargetId:15)" in file "C:\Program Files\MSBuild\Microsoft.Cpp\v4.0\Microsoft.CppClean.targets" from project "D:\Perforce\Projects\PE2\PackEditor2\PackEditor2\PackEditor2.vcxproj" (target "CppClean" depends on it):
1>Done building target "AfterCppClean" in project "PackEditor2.vcxproj".: (TargetId:15)
1>Target "PGInstrumentedClean: (TargetId:16)" in file "C:\Program Files\MSBuild\Microsoft.Cpp\v4.0\Microsoft.CppClean.targets" from project "D:\Perforce\Projects\PE2\PackEditor2\PackEditor2\PackEditor2.vcxproj" (target "CppClean" depends on it):
1>Task "Delete" (TaskId:16)
1>Done executing task "Delete". (TaskId:16)
1>Done building target "PGInstrumentedClean" in project "PackEditor2.vcxproj".: (TargetId:16)
1>Target "CppClean: (TargetId:17)" in file "C:\Program Files\MSBuild\Microsoft.Cpp\v4.0\Microsoft.CppClean.targets" from project "D:\Perforce\Projects\PE2\PackEditor2\PackEditor2\PackEditor2.vcxproj" (target "Clean" depends on it):
1>Done building target "CppClean" in project "PackEditor2.vcxproj".: (TargetId:17)
1>Target "Clean: (TargetId:18)" in file "C:\Windows\Microsoft.NET\Framework\v4.0.30319\Microsoft.Common.Targets" from project "D:\Perforce\Projects\PE2\PackEditor2\PackEditor2\PackEditor2.vcxproj" (target "Rebuild" depends on it):
1>Done building target "Clean" in project "PackEditor2.vcxproj".: (TargetId:18)
1>Target "_DetermineManagedStateFromCL" skipped. Previously built successfully.
1>Target "_PrepareForBuild: (TargetId:19)" in file "C:\Program Files\MSBuild\Microsoft.Cpp\v4.0\Microsoft.BuildSteps.Targets" from project "D:\Perforce\Projects\PE2\PackEditor2\PackEditor2\PackEditor2.vcxproj" (target "Build" depends on it):
1>Done building target "_PrepareForBuild" in project "PackEditor2.vcxproj".: (TargetId:19)
1>Target "SetBuildDefaultEnvironmentVariables: (TargetId:20)" in file "C:\Program Files\MSBuild\Microsoft.Cpp\v4.0\Microsoft.Cpp.targets" from project "D:\Perforce\Projects\PE2\PackEditor2\PackEditor2\PackEditor2.vcxproj" (target "Build" depends on it):
1>Using "SetEnv" task from assembly "Microsoft.Build.CppTasks.Common, Version=4.0.0.0, Culture=neutral, PublicKeyToken=b03f5f7f11d50a3a".
1>Task "SetEnv" (TaskId:17)
1> PATH=C:\Program Files\Microsoft Visual Studio 10.0\VC\bin;C:\Program Files\Microsoft SDKs\Windows\v7.0A\bin\NETFX 4.0 Tools;C:\Program Files\Microsoft SDKs\Windows\v7.0A\bin;C:\Program Files\Microsoft Visual Studio 10.0\Common7\Tools\bin;C:\Program Files\Microsoft Visual Studio 10.0\Common7\tools;C:\Program Files\Microsoft Visual Studio 10.0\Common7\ide;C:\Program Files\HTML Help Workshop;C:\Program Files\Microsoft SDKs\Windows\v7.0A\\bin;C:\Windows\Microsoft.NET\Framework\v4.0.30319\;C:\Program Files\Microsoft Visual Studio 10.0\;C:\Windows\SysWow64;;D:\Perforce\3rdParty\Intel\IPP\redist\ia32;C:\Program Files\Intel\ComposerXE-2011\redist\ia32\ipp;C:\Program Files\Common Files\Microsoft Shared\Windows Live;C:\Windows\system32;C:\Windows;C:\Windows\System32\Wbem;C:\Windows\System32\WindowsPowerShell\v1.0\;c:\Program Files\Microsoft SQL Server\100\Tools\Binn\;c:\Program Files\Microsoft SQL Server\100\DTS\Binn\;C:\Program Files\Perforce;C:\Program Files\Windows Live\Shared;d:\perforce\3rdParty\Microsoft;;C:\Program Files\WinMerge;d:\perforce\trivision\bin;d:\perforce\trivision\bin\debug;D:\Perforce\3rdParty\Microsoft\VC71;K:\MsVc71;D:\Perforce\3rdParty\VTK\bin;d:\perforce\3rdparty\qt\qt\bin;D:\Perforce\3rdParty\AVT\FirePackage2V11\UniAPI\Lib;D:\Perforce\3rdParty\AVT\FirePackage2V11\FireGrab\Lib;C:\Program Files\MySQL\MySQL Server 5.1\bin;C:\Program Files\QuickTime\QTSystem\; (TaskId:17)
1>Done executing task "SetEnv". (TaskId:17)
1>Task "SetEnv" skipped, due to false condition; ('$(_IsNativeEnvironment)' == 'true') was evaluated as ('' == 'true').
1>Task "SetEnv" (TaskId:18)
1> LIB=C:\Program Files\Microsoft Visual Studio 10.0\VC\lib;C:\Program Files\Microsoft Visual Studio 10.0\VC\atlmfc\lib;C:\Program Files\Microsoft SDKs\Windows\v7.0A\lib;C:\Program Files\Microsoft SDKs\Windows\v7.0A\\lib (TaskId:18)
1>Done executing task "SetEnv". (TaskId:18)
1>Task "SetEnv" (TaskId:19)
1> LIBPATH=C:\Program Files\Microsoft Visual Studio 10.0\VC\atlmfc\lib;C:\Program Files\Microsoft Visual Studio 10.0\VC\lib (TaskId:19)
1>Done executing task "SetEnv". (TaskId:19)
1>Task "SetEnv" (TaskId:20)
1> INCLUDE=C:\Program Files\Microsoft Visual Studio 10.0\VC\include;C:\Program Files\Microsoft Visual Studio 10.0\VC\atlmfc\include;C:\Program Files\Microsoft SDKs\Windows\v7.0A\include;C:\Program Files\Microsoft SDKs\Windows\v7.0A\\include; (TaskId:20)
1>Done executing task "SetEnv". (TaskId:20)
1>Done building target "SetBuildDefaultEnvironmentVariables" in project "PackEditor2.vcxproj".: (TargetId:20)
1>Target "SetUserMacroEnvironmentVariables" skipped, due to false condition; ('@(BuildMacro)' != '') was evaluated as ('' != '').
1>Target "BeforeResolveReferences: (TargetId:21)" in file "C:\Windows\Microsoft.NET\Framework\v4.0.30319\Microsoft.Common.Targets" from project "D:\Perforce\Projects\PE2\PackEditor2\PackEditor2\PackEditor2.vcxproj" (target "ResolveReferences" depends on it):
1>Done building target "BeforeResolveReferences" in project "PackEditor2.vcxproj".: (TargetId:21)
1>Target "AssignProjectConfiguration" skipped, due to false condition; ('@(ProjectReference)'!='') was evaluated as (''!='').
1>Target "AssignProjectConfiguration" skipped, due to false condition; ('@(ProjectReference)'!='') was evaluated as (''!='').
1>Target "_SplitProjectReferencesByFileExistence" skipped. Previously built successfully.
1>Target "_RemoveNameMetadataFromProjectReferenceItems" skipped, due to false condition; ('@(ProjectReference)'!='') was evaluated as (''!='').
1>Target "ResolveProjectReferences: (TargetId:22)" in file "C:\Windows\Microsoft.NET\Framework\v4.0.30319\Microsoft.Common.Targets" from project "D:\Perforce\Projects\PE2\PackEditor2\PackEditor2\PackEditor2.vcxproj" (target "ResolveReferences" depends on it):
1>Task "MSBuild" skipped, due to false condition; ('%(_MSBuildProjectReferenceExistent.BuildReference)' == 'true' and '@(ProjectReferenceWithConfiguration)' != '' and ('$(BuildingInsideVisualStudio)' == 'true' or '$(BuildProjectReferences)' != 'true') and '@(_MSBuildProjectReferenceExistent)' != '') was evaluated as ('' == 'true' and '' != '' and ('true' == 'true' or 'true' != 'true') and '' != '').
1>Task "MSBuild" skipped, due to false condition; ('%(_MSBuildProjectReferenceExistent.BuildReference)' == 'true' and '@(ProjectReferenceWithConfiguration)' != '' and '$(BuildingInsideVisualStudio)' != 'true' and '$(BuildProjectReferences)' == 'true' and '@(_MSBuildProjectReferenceExistent)' != '') was evaluated as ('' == 'true' and '' != '' and 'true' != 'true' and 'true' == 'true' and '' != '').
1>Task "MSBuild" skipped, due to false condition; ('%(_MSBuildProjectReferenceExistent.BuildReference)' == 'true' and '@(ProjectReferenceWithConfiguration)' != '' and '$(BuildingProject)' == 'true' and '@(_MSBuildProjectReferenceExistent)' != '') was evaluated as ('' == 'true' and '' != '' and 'true' == 'true' and '' != '').
1>Task "Warning" skipped, due to false condition; ('@(ProjectReferenceWithConfiguration)' != '' and '@(_MSBuildProjectReferenceNonexistent)' != '') was evaluated as ('' != '' and '' != '').
1>Done building target "ResolveProjectReferences" in project "PackEditor2.vcxproj".: (TargetId:22)
1>Target "ResolveNativeReferences" skipped, due to false condition; ('@(NativeReference)'!='') was evaluated as (''!='').
1>Target "ResolveAssemblyReferences" skipped, due to false condition; ('@(Reference)'!='' or '@(_ResolvedProjectReferencePaths)'!='' or '@(_ExplicitReference)' != '') was evaluated as (''!='' or ''!='' or '' != '').
1>Target "ResolveComReferences" skipped, due to false condition; ('@(COMReference)'!='' or '@(COMFileReference)'!='') was evaluated as (''!='' or ''!='').
1>Target "AfterResolveReferences: (TargetId:23)" in file "C:\Windows\Microsoft.NET\Framework\v4.0.30319\Microsoft.Common.Targets" from project "D:\Perforce\Projects\PE2\PackEditor2\PackEditor2\PackEditor2.vcxproj" (target "ResolveReferences" depends on it):
1>Done building target "AfterResolveReferences" in project "PackEditor2.vcxproj".: (TargetId:23)
1>Target "ResolveTestReferences" skipped, due to false condition; ('@(Shadow)'!='') was evaluated as (''!='').
1>Target "ResolveReferences: (TargetId:24)" in file "C:\Windows\Microsoft.NET\Framework\v4.0.30319\Microsoft.Common.Targets" from project "D:\Perforce\Projects\PE2\PackEditor2\PackEditor2\PackEditor2.vcxproj" (target "Build" depends on it):
1>Done building target "ResolveReferences" in project "PackEditor2.vcxproj".: (TargetId:24)
1>Target "PlatformPrepareForBuild: (TargetId:25)" in file "C:\Program Files\MSBuild\Microsoft.Cpp\v4.0\Platforms\Win32\Microsoft.Cpp.Win32.Targets" from project "D:\Perforce\Projects\PE2\PackEditor2\PackEditor2\PackEditor2.vcxproj" (target "PrepareForBuild" depends on it):
1>Task "VCMessage" skipped, due to false condition; (!(exists('$(VCTargetsPath)\Platforms\Win32\PlatformToolsets\$(PlatformToolset)\Microsoft.Cpp.Win32.$(PlatformToolset).targets'))) was evaluated as (!(exists('C:\Program Files\MSBuild\Microsoft.Cpp\v4.0\\Platforms\Win32\PlatformToolsets\v100\Microsoft.Cpp.Win32.v100.targets'))).
1>Done building target "PlatformPrepareForBuild" in project "PackEditor2.vcxproj".: (TargetId:25)
1>Target "GetFrameworkPaths: (TargetId:26)" in file "C:\Windows\Microsoft.NET\Framework\v4.0.30319\Microsoft.NETFramework.targets" from project "D:\Perforce\Projects\PE2\PackEditor2\PackEditor2\PackEditor2.vcxproj" (target "PrepareForBuild" depends on it):
1>Done building target "GetFrameworkPaths" in project "PackEditor2.vcxproj".: (TargetId:26)
1>Target "GetWinFXPath" skipped, due to false condition; (('@(Page)' != '' or '@(ApplicationDefinition)' != '' or '@(Resource)' != '') and ('$(GetWinFXNativePath)' != '' or '$(GetWinFXWoWPath)' != '' )) was evaluated as (('' != '' or '' != '' or '' != '') and ('' != '' or '' != '' )).
1>Target "GetReferenceAssemblyPaths: (TargetId:27)" in file "C:\Windows\Microsoft.NET\Framework\v4.0.30319\Microsoft.Common.Targets" from project "D:\Perforce\Projects\PE2\PackEditor2\PackEditor2\PackEditor2.vcxproj" (target "PrepareForBuild" depends on it):
1>Task "GetReferenceAssemblyPaths" skipped, due to false condition; ('$(TargetFrameworkMoniker)' != '' and ('$(_TargetFrameworkDirectories)' == '' or '$(_FullFrameworkReferenceAssemblyPaths)' == '')) was evaluated as ('.NETFramework,Version=v4.0' != '' and ('C:\Program Files\Reference Assemblies\Microsoft\Framework\.NETFramework\v4.0' == '' or 'C:\Program Files\Reference Assemblies\Microsoft\Framework\.NETFramework\v4.0' == '')).
1>Done building target "GetReferenceAssemblyPaths" in project "PackEditor2.vcxproj".: (TargetId:27)
1>Target "PrepareForBuild: (TargetId:28)" in file "C:\Program Files\MSBuild\Microsoft.Cpp\v4.0\Microsoft.CppBuild.targets" from project "D:\Perforce\Projects\PE2\PackEditor2\PackEditor2\PackEditor2.vcxproj" (target "Build" depends on it):
1>Task "VCMessage" skipped, due to false condition; ('$(DesignTimeBuild)'!='true' and '$(ConfigurationPlatformExists)' != 'true') was evaluated as (''!='true' and 'true' != 'true').
1>Task "MakeDir" (TaskId:21)
1>Done executing task "MakeDir". (TaskId:21)
1>Task "VCMessage" skipped, due to false condition; ('$(DesignTimeBuild)'!='true' and '$(VCInstallDir)'=='' and '$(UseEnv)' != 'true' and ($(TargetFrameworkVersion)=='v3.5' or $(TargetFrameworkVersion)=='v3.0' or $(TargetFrameworkVersion)=='v2.0' )) was evaluated as (''!='true' and 'C:\Program Files\Microsoft Visual Studio 10.0\VC\'=='' and '' != 'true' and (v4.0=='v3.5' or v4.0=='v3.0' or v4.0=='v2.0' )).
1>Task "VCMessage" skipped, due to false condition; ('$(DesignTimeBuild)'!='true' and '$(VCInstallDir)'=='' and '$(UseEnv)' != 'true' and '$(PlatformToolset)'=='v90') was evaluated as (''!='true' and 'C:\Program Files\Microsoft Visual Studio 10.0\VC\'=='' and '' != 'true' and 'v100'=='v90').
1>Task "VCMessage" skipped, due to false condition; ('$(VCInstallDir)'=='' and '$(UseEnv)' != 'true') was evaluated as ('C:\Program Files\Microsoft Visual Studio 10.0\VC\'=='' and '' != 'true').
1>Task "VCMessage" skipped, due to false condition; ('$(WindowsSDKDir)'=='' and '$(UseEnv)' != 'true') was evaluated as ('C:\Program Files\Microsoft SDKs\Windows\v7.0A\'=='' and '' != 'true').
1>Task "VCMessage" skipped, due to false condition; ('$(IntDirTrailingSlashWarning)'=='true') was evaluated as (''=='true').
1>Task "VCMessage" skipped, due to false condition; ('$(OutDirTrailingSlashWarning)'=='true') was evaluated as (''=='true').
1>Task "MakeDir" (TaskId:22)
1>Done executing task "MakeDir". (TaskId:22)
1>Done building target "PrepareForBuild" in project "PackEditor2.vcxproj".: (TargetId:28)
1>Target "PrepareForBuild" skipped. Previously built successfully.
1>Target "InitializeBuildStatus: (TargetId:29)" in file "C:\Program Files\MSBuild\Microsoft.Cpp\v4.0\Microsoft.CppBuild.targets" from project "D:\Perforce\Projects\PE2\PackEditor2\PackEditor2\PackEditor2.vcxproj" (target "Build" depends on it):
1>Task "ReadLinesFromFile" (TaskId:23)
1>Done executing task "ReadLinesFromFile". (TaskId:23)
1>Task "WriteLinesToFile" (TaskId:24)
1>Done executing task "WriteLinesToFile". (TaskId:24)
1>Using "Touch" task from assembly "Microsoft.Build.Tasks.v4.0, Version=4.0.0.0, Culture=neutral, PublicKeyToken=b03f5f7f11d50a3a".
1>Task "Touch" (TaskId:25)
1> Touching "Debug\PackEditor2.unsuccessfulbuild". (TaskId:25)
1>Done executing task "Touch". (TaskId:25)
1>Done building target "InitializeBuildStatus" in project "PackEditor2.vcxproj".: (TargetId:29)
1>Target "AssignProjectConfiguration" skipped, due to false condition; ('@(ProjectReference)'!='') was evaluated as (''!='').
1>Target "_SplitProjectReferencesByFileExistence" skipped. Previously built successfully.
1>Target "BuildGenerateSourcesTraverse: (TargetId:30)" in file "C:\Windows\Microsoft.NET\Framework\v4.0.30319\Microsoft.Common.Targets" from project "D:\Perforce\Projects\PE2\PackEditor2\PackEditor2\PackEditor2.vcxproj" (target "BuildGenerateSources" depends on it):
1>Task "MSBuild" skipped, due to false condition; ('$(BuildPassReferences)' == 'true' and '@(ProjectReferenceWithConfiguration)' != '' and '@(_MSBuildProjectReferenceExistent)' != '' and '%(_MSBuildProjectReferenceExistent.BuildReference)' == 'true') was evaluated as ('' == 'true' and '' != '' and '' != '' and '' == 'true').
1>Done building target "BuildGenerateSourcesTraverse" in project "PackEditor2.vcxproj".: (TargetId:30)
1>Target "SetBuildDefaultEnvironmentVariables" skipped. Previously built successfully.
1>Target "SetUserMacroEnvironmentVariables" skipped, due to false condition; ('@(BuildMacro)' != '') was evaluated as ('' != '').
1>Target "PrepareForBuild" skipped. Previously built successfully.
1>Target "ResolveReferences" skipped. Previously built successfully.
1>Target "BeforeBuildGenerateSources: (TargetId:31)" in file "C:\Program Files\MSBuild\Microsoft.Cpp\v4.0\Microsoft.BuildSteps.Targets" from project "D:\Perforce\Projects\PE2\PackEditor2\PackEditor2\PackEditor2.vcxproj" (target "BuildGenerateSources" depends on it):
1>Done building target "BeforeBuildGenerateSources" in project "PackEditor2.vcxproj".: (TargetId:31)
1>Target "PreBuildEvent: (TargetId:32)" in file "C:\Program Files\MSBuild\Microsoft.Cpp\v4.0\Microsoft.CppCommon.targets" from project "D:\Perforce\Projects\PE2\PackEditor2\PackEditor2\PackEditor2.vcxproj" (target "BuildGenerateSources" depends on it):
1>Task "Message" skipped, due to false condition; ('%(PreBuildEvent.Message)' != '' and '%(PreBuildEvent.Command)' != '') was evaluated as ('' != '' and '' != '').
1>Task "Exec" skipped, due to false condition; ('%(PreBuildEvent.Command)' != '') was evaluated as ('' != '').
1>Done building target "PreBuildEvent" in project "PackEditor2.vcxproj".: (TargetId:32)
1>Target "CustomBuild" skipped, due to false condition; ('@(CustomBuild)' != '') was evaluated as ('' != '').
1>Target "_GenerateXMLData: (TargetId:33)" in file "C:\Program Files\MSBuild\Microsoft.Cpp\v4.0\Microsoft.CppBuild.targets" from project "D:\Perforce\Projects\PE2\PackEditor2\PackEditor2\PackEditor2.vcxproj" (target "BuildGenerateSources" depends on it):
1>Done building target "_GenerateXMLData" in project "PackEditor2.vcxproj".: (TargetId:33)
1>Target "_GenerateWebServiceProxy: (TargetId:34)" in file "C:\Program Files\MSBuild\Microsoft.Cpp\v4.0\Microsoft.CppBuild.targets" from project "D:\Perforce\Projects\PE2\PackEditor2\PackEditor2\PackEditor2.vcxproj" (target "BuildGenerateSources" depends on it):
1>Done building target "_GenerateWebServiceProxy" in project "PackEditor2.vcxproj".: (TargetId:34)
1>Target "Xsd" skipped, due to false condition; ('@(Xsd)' != '') was evaluated as ('' != '').
1>Target "_Xsd: (TargetId:35)" in file "C:\Program Files\MSBuild\Microsoft.Cpp\v4.0\Microsoft.CppBuild.targets" from project "D:\Perforce\Projects\PE2\PackEditor2\PackEditor2\PackEditor2.vcxproj" (target "BuildGenerateSources" depends on it):
1>Done building target "_Xsd" in project "PackEditor2.vcxproj".: (TargetId:35)
1>Target "MakeDirsForMidl: (TargetId:36)" in file "C:\Program Files\MSBuild\Microsoft.Cpp\v4.0\Microsoft.CppBuild.targets" from project "D:\Perforce\Projects\PE2\PackEditor2\PackEditor2\PackEditor2.vcxproj" (target "_Midl" depends on it):
1>Task "Makedir" (TaskId:26)
1>Done executing task "Makedir". (TaskId:26)
1>Done building target "MakeDirsForMidl" in project "PackEditor2.vcxproj".: (TargetId:36)
1>Target "Midl" skipped, due to false condition; ('@(Midl)' != '') was evaluated as ('' != '').
1>Target "CustomBuild" skipped, due to false condition; ('@(CustomBuild)' != '') was evaluated as ('' != '').
1>Target "ComputeMIDLGeneratedCompileInputs: (TargetId:37)" in file "C:\Program Files\MSBuild\Microsoft.Cpp\v4.0\Microsoft.CppBuild.targets" from project "D:\Perforce\Projects\PE2\PackEditor2\PackEditor2\PackEditor2.vcxproj" (target "_Midl" depends on it):
1>Done building target "ComputeMIDLGeneratedCompileInputs" in project "PackEditor2.vcxproj".: (TargetId:37)
1>Target "AfterMidl: (TargetId:38)" in file "C:\Program Files\MSBuild\Microsoft.Cpp\v4.0\Microsoft.CppBuild.targets" from project "D:\Perforce\Projects\PE2\PackEditor2\PackEditor2\PackEditor2.vcxproj" (target "_Midl" depends on it):
1>Done building target "AfterMidl" in project "PackEditor2.vcxproj".: (TargetId:38)
1>Target "_Midl: (TargetId:39)" in file "C:\Program Files\MSBuild\Microsoft.Cpp\v4.0\Microsoft.CppBuild.targets" from project "D:\Perforce\Projects\PE2\PackEditor2\PackEditor2\PackEditor2.vcxproj" (target "BuildGenerateSources" depends on it):
1>Done building target "_Midl" in project "PackEditor2.vcxproj".: (TargetId:39)
1>Target "AfterBuildGenerateSources: (TargetId:40)" in file "C:\Program Files\MSBuild\Microsoft.Cpp\v4.0\Microsoft.BuildSteps.Targets" from project "D:\Perforce\Projects\PE2\PackEditor2\PackEditor2\PackEditor2.vcxproj" (target "BuildGenerateSources" depends on it):
1>Done building target "AfterBuildGenerateSources" in project "PackEditor2.vcxproj".: (TargetId:40)
1>Target "AfterBuildGenerateSourcesEvent: (TargetId:41)" in file "C:\Program Files\MSBuild\Microsoft.Cpp\v4.0\Microsoft.CppBuild.targets" from project "D:\Perforce\Projects\PE2\PackEditor2\PackEditor2\PackEditor2.vcxproj" (target "BuildGenerateSources" depends on it):
1>Done building target "AfterBuildGenerateSourcesEvent" in project "PackEditor2.vcxproj".: (TargetId:41)
1>Target "BuildGenerateSources: (TargetId:42)" in file "C:\Windows\Microsoft.NET\Framework\v4.0.30319\Microsoft.Common.Targets" from project "D:\Perforce\Projects\PE2\PackEditor2\PackEditor2\PackEditor2.vcxproj" (target "Build" depends on it):
1>Done building target "BuildGenerateSources" in project "PackEditor2.vcxproj".: (TargetId:42)
1>Target "AssignProjectConfiguration" skipped, due to false condition; ('@(ProjectReference)'!='') was evaluated as (''!='').
1>Target "_SplitProjectReferencesByFileExistence" skipped. Previously built successfully.
1>Target "BuildCompileTraverse: (TargetId:43)" in file "C:\Windows\Microsoft.NET\Framework\v4.0.30319\Microsoft.Common.Targets" from project "D:\Perforce\Projects\PE2\PackEditor2\PackEditor2\PackEditor2.vcxproj" (target "BuildCompile" depends on it):
1>Task "MSBuild" skipped, due to false condition; ('$(BuildPassReferences)' == 'true' and '@(ProjectReferenceWithConfiguration)' != '' and '@(_MSBuildProjectReferenceExistent)' != '' and '%(_MSBuildProjectReferenceExistent.BuildReference)' == 'true') was evaluated as ('' == 'true' and '' != '' and '' != '' and '' == 'true').
1>Done building target "BuildCompileTraverse" in project "PackEditor2.vcxproj".: (TargetId:43)
1>Target "SetBuildDefaultEnvironmentVariables" skipped. Previously built successfully.
1>Target "SetUserMacroEnvironmentVariables" skipped, due to false condition; ('@(BuildMacro)' != '') was evaluated as ('' != '').
1>Target "PrepareForBuild" skipped. Previously built successfully.
1>Target "ResolveReferences" skipped. Previously built successfully.
1>Target "BeforeClCompile: (TargetId:44)" in file "C:\Program Files\MSBuild\Microsoft.Cpp\v4.0\Microsoft.CppBuild.targets" from project "D:\Perforce\Projects\PE2\PackEditor2\PackEditor2\PackEditor2.vcxproj" (target "_ClCompile" depends on it):
1>Done building target "BeforeClCompile" in project "PackEditor2.vcxproj".: (TargetId:44)
1>Target "ComputeMIDLGeneratedCompileInputs" skipped. Previously built successfully.
1>Target "ComputeCLInputPDBName: (TargetId:45)" in file "C:\Program Files\MSBuild\Microsoft.Cpp\v4.0\Microsoft.CppBuild.targets" from project "D:\Perforce\Projects\PE2\PackEditor2\PackEditor2\PackEditor2.vcxproj" (target "_ClCompile" depends on it):
1>Done building target "ComputeCLInputPDBName" in project "PackEditor2.vcxproj".: (TargetId:45)
1>Target "ResolveReferences" skipped. Previously built successfully.
1>Target "ComputeReferenceCLInput: (TargetId:46)" in file "C:\Program Files\MSBuild\Microsoft.Cpp\v4.0\Microsoft.CppBuild.targets" from project "D:\Perforce\Projects\PE2\PackEditor2\PackEditor2\PackEditor2.vcxproj" (target "_ClCompile" depends on it):
1>Task "WriteLinesToFile" skipped, due to false condition; (('@(ProjectReference)'!='' or '@(Reference)'!='')) was evaluated as ((''!='' or ''!='')).
1>Task "Message" skipped, due to false condition; ('$(_REFERENCE_DEBUG)'=='true' and '%(ClCompile.CompileAsManaged)' != 'false' and '%(ClCompile.CompileAsManaged)' != '') was evaluated as (''=='true' and '' != 'false' and '' != '').
1>Done building target "ComputeReferenceCLInput" in project "PackEditor2.vcxproj".: (TargetId:46)
1>Target "MakeDirsForCl: (TargetId:47)" in file "C:\Program Files\MSBuild\Microsoft.Cpp\v4.0\Microsoft.CppBuild.targets" from project "D:\Perforce\Projects\PE2\PackEditor2\PackEditor2\PackEditor2.vcxproj" (target "_ClCompile" depends on it):
1>Task "MakeDir" (TaskId:27)
1>Done executing task "MakeDir". (TaskId:27)
1>Done building target "MakeDirsForCl" in project "PackEditor2.vcxproj".: (TargetId:47)
1>Target "PrepareForBuild" skipped. Previously built successfully.
1>Target "SetBuildDefaultEnvironmentVariables" skipped. Previously built successfully.
1>Target "SetUserMacroEnvironmentVariables" skipped, due to false condition; ('@(BuildMacro)' != '') was evaluated as ('' != '').
1>Target "_SelectedFiles: (TargetId:48)" in file "C:\Program Files\MSBuild\Microsoft.Cpp\v4.0\Microsoft.CppBuild.targets" from project "D:\Perforce\Projects\PE2\PackEditor2\PackEditor2\PackEditor2.vcxproj" (target "SelectClCompile" depends on it):
1>Done building target "_SelectedFiles" in project "PackEditor2.vcxproj".: (TargetId:48)
1>Target "ComputeMIDLGeneratedCompileInputs" skipped. Previously built successfully.
1>Target "ComputeCLInputPDBName" skipped. Previously built successfully.
1>Target "ComputeReferenceCLInput" skipped. Previously built successfully.
1>Target "_SelectedFiles" skipped. Previously built successfully.
1>Target "SelectCustomBuild: (TargetId:49)" in file "C:\Program Files\MSBuild\Microsoft.Cpp\v4.0\Microsoft.CppBuild.targets" from project "D:\Perforce\Projects\PE2\PackEditor2\PackEditor2\PackEditor2.vcxproj" (target "SelectClCompile" depends on it):
1>Done building target "SelectCustomBuild" in project "PackEditor2.vcxproj".: (TargetId:49)
1>Target "SelectClCompile: (TargetId:50)" in file "C:\Program Files\MSBuild\Microsoft.Cpp\v4.0\Microsoft.CppBuild.targets" from project "D:\Perforce\Projects\PE2\PackEditor2\PackEditor2\PackEditor2.vcxproj" (target "ClCompile" depends on it):
1>Done building target "SelectClCompile" in project "PackEditor2.vcxproj".: (TargetId:50)
1>Target "GenerateTargetFrameworkMonikerAttribute" skipped, due to false condition; ('$(GenerateTargetFrameworkAttribute)' == 'true') was evaluated as ('false' == 'true').
1>Target "ManagedIncrementalBuildPreProcessDependencyGraph" skipped, due to false condition; ('@(ClCompile)' != '' and '$(EnableManagedIncrementalBuild)' == 'True') was evaluated as ('PackEditor2.cpp;PackEditor2Dlg.cpp;stdafx.cpp' != '' and 'false' == 'True').
1>Target "CheckInstalledLibsIPP" skipped, due to false condition; ('$(UseIntelIPP)' == 'true') was evaluated as ('false' == 'true').
1>Target "CheckIntelEnvironmentForLibsIPP" skipped, due to false condition; ('$(UseIntelIPP)' == 'true' and '$(UseEnv)' != 'true') was evaluated as ('false' == 'true' and '' != 'true').
1>Target "ClCompile: (TargetId:51)" in file "C:\Program Files\MSBuild\Microsoft.Cpp\v4.0\Platforms\Win32\Microsoft.Cpp.Win32.Targets" from project "D:\Perforce\Projects\PE2\PackEditor2\PackEditor2\PackEditor2.vcxproj" (target "_ClCompile" depends on it):
1>Task "Delete" (TaskId:28)
1> File "Debug\PackEditor2.pch" doesn't exist. Skipping. (TaskId:28)
1>Done executing task "Delete". (TaskId:28)
1>Task "CL" skipped, due to false condition; ('%(ClCompile.PrecompiledHeader)' == 'Create' and '%(ClCompile.ExcludedFromBuild)'!='true') was evaluated as ('Use' == 'Create' and ''!='true').
1>Using "CL" task from assembly "Microsoft.Build.CppTasks.Win32, Version=4.0.0.0, Culture=neutral, PublicKeyToken=b03f5f7f11d50a3a".
1>Task "CL" (TaskId:29)
1> Environment Variables passed to tool: (TaskId:29)
1>    VS_UNICODE_OUTPUT=792 (TaskId:29)
1> Tracking command: (TaskId:29)
1> C:\Program Files\Microsoft SDKs\Windows\v7.0A\bin\NETFX 4.0 Tools\Tracker.exe /d C:\Windows\Microsoft.NET\Framework\v4.0.30319\FileTracker.dll /i D:\Perforce\Projects\PE2\PackEditor2\PackEditor2\Debug /r D:\PERFORCE\PROJECTS\PE2\PACKEDITOR2\PACKEDITOR2\STDAFX.CPP /b MSBuildConsole_CancelEventbd00a7ed0693487d8591b8ecd38a3b0a /c "C:\Program Files\Microsoft Visual Studio 10.0\VC\bin\CL.exe" /c /ZI /nologo /W3 /WX- /Od /Oy- /D WIN32 /D _WINDOWS /D _DEBUG /D _UNICODE /D UNICODE /D _AFXDLL /Gm /EHsc /RTC1 /MDd /GS /fp:precise /Zc:wchar_t /Zc:forScope /Yc"StdAfx.h" /Fp"Debug\PackEditor2.pch" /Fo"Debug\\" /Fd"Debug\vc100.pdb" /Gd /TP /analyze- /errorReport:prompt stdafx.cpp (TaskId:29)
1> stdafx.cpp (TaskId:29)
1>c:\program files\microsoft visual studio 10.0\vc\atlmfc\include\atltransactionmanager.h(262): error C3861: 'AtlLoadSystemLibraryUsingFullPath': identifier not found
1>c:\program files\microsoft visual studio 10.0\vc\atlmfc\include\atltransactionmanager.h(312): error C3861: 'AtlLoadSystemLibraryUsingFullPath': identifier not found
1>c:\program files\microsoft visual studio 10.0\vc\atlmfc\include\atltransactionmanager.h(342): error C3861: 'AtlLoadSystemLibraryUsingFullPath': identifier not found
1> The command exited with code 2. (TaskId:29)
1>Done executing task "CL" -- FAILED. (TaskId:29)
1>Done building target "ClCompile" in project "PackEditor2.vcxproj" -- FAILED.: (TargetId:51)
1>
1>Project Performance Summary:
1>     4370 ms D:\Perforce\Projects\PE2\PackEditor2\PackEditor2\PackEditor2.vcxproj 1 calls
1>             4370 ms rebuild                                    1 calls
1>
1>Target Performance Summary:
1>        0 ms ComputeCLInputPDBName                     1 calls
1>        0 ms _PrepareForBuild                         1 calls
1>        0 ms BeforeClean                                1 calls
1>        0 ms _GenerateXMLData                         1 calls
1>        0 ms _SelectedFiles                             1 calls
1>        0 ms BuildGenerateSources                     1 calls
1>        0 ms GetReferenceAssemblyPaths                 1 calls
1>        0 ms _Xsd                                     1 calls
1>        0 ms AfterCppClean                             1 calls
1>        0 ms BuildGenerateSourcesTraverse             1 calls
1>        0 ms Clean                                     1 calls
1>        0 ms _Midl                                     1 calls
1>        0 ms _GenerateWebServiceProxy                 1 calls
1>        0 ms AfterResolveReferences                     1 calls
1>        0 ms BeforeBuildGenerateSources                 1 calls
1>        0 ms ComputeReferenceCLInput                    1 calls
1>        0 ms CleanPublishFolder                         1 calls
1>        0 ms BeforeRebuild                             1 calls
1>        0 ms MakeDirsForMidl                            1 calls
1>        0 ms BuildCompileTraverse                     1 calls
1>        0 ms GetFrameworkPaths                         1 calls
1>        0 ms AfterBuildGenerateSourcesEvent             1 calls
1>        0 ms AfterClean                                 1 calls
1>        0 ms ResolveReferences                         1 calls
1>        0 ms BeforeCppClean                             1 calls
1>        0 ms BeforeClCompile                            1 calls
1>        0 ms CleanReferencedProjects                    1 calls
1>        0 ms SelectClCompile                            1 calls
1>        0 ms AfterBuildGenerateSources                 1 calls
1>        0 ms CppClean                                 1 calls
1>        0 ms SelectCustomBuild                         1 calls
1>        0 ms BeforeResolveReferences                    1 calls
1>        0 ms AfterMidl                                 1 calls
1>        0 ms PreBuildEvent                             1 calls
1>        0 ms _SplitProjectReferencesByFileExistence     1 calls
1>        1 ms PrepareForBuild                            1 calls
1>        1 ms PGInstrumentedClean                        1 calls
1>        1 ms ComputeMIDLGeneratedCompileInputs         1 calls
1>        1 ms _DetermineManagedStateFromCL             1 calls
1>        1 ms PlatformPrepareForBuild                    1 calls
1>        1 ms _PrepareForRebuild                         1 calls
1>        1 ms ResolveProjectReferences                 1 calls
1>        2 ms _PrepareForClean                         1 calls
1>        2 ms MakeDirsForCl                             1 calls
1>        4 ms CoreClean                                 1 calls
1>        4 ms SetBuildDefaultEnvironmentVariables        1 calls
1>        5 ms InitializeBuildStatus                     1 calls
1>     17 ms _CheckForInvalidConfigurationAndPlatform 1 calls
1>     264 ms CoreCppClean                             1 calls
1>     4060 ms ClCompile                                 1 calls
1>
1>Task Performance Summary:
1>        0 ms ReadLinesFromFile                         2 calls
1>        1 ms MakeDir                                    6 calls
1>        1 ms RemoveDuplicates                         1 calls
1>        1 ms FindUnderPath                             2 calls
1>        2 ms Delete                                     5 calls
1>        2 ms Touch                                     1 calls
1>        3 ms SetEnv                                     4 calls
1>        3 ms Message                                    2 calls
1>        7 ms WriteLinesToFile                         3 calls
1>     256 ms CppClean                                 1 calls
1>     4055 ms CL                                         1 calls
1>
1>Build FAILED.
1>
1>Time Elapsed 00:00:04.36
========== Rebuild All: 0 succeeded, 1 failed, 0 skipped ==========
====================================================
Posted by Microsoft on 5/11/2011 at 11:28 PM
Hi, given that we have not heard back from you in 7 days. We will go ahead and close this Connect Issue. If you get a chance to review and provide the information requested earlier, you can go ahead and reactivate this issue.
Posted by Microsoft on 5/4/2011 at 10:28 PM
Hi Mohammed,

Could you please provide us with the build log? You can get them easily by going to Tools/Options, Projects/Solutions, Build/Run, and setting the MSBuild verbosity to "Diagnostic" in both dropdowns. Then, just copy/paste from the Output Window in the IDE.

For command line, you can pass in "/v:diag" switch to MSBuild.EXE and it will produce a diagnostic-level log.
Posted by Mohammed A Khan on 5/3/2011 at 10:41 AM
I am experiencing the same issue on Windows XP Professional after latest runtime updates. However on Windows7 and Vista this does not occur show.
Posted by Jymmi88 on 5/3/2011 at 8:13 AM
Because of the impact this error had on the on-going development effort our staff proceeded with un-installing VS 2010 then re-installing it as a work-around. It is currently working as it was prior to the reported error. Because of our effort proceeded your request for diagnostic data, I am not able to provide the details requested. Maybe another developer(s) could provide this information if possible. I would like to know which update to avoid and/or what exactly caused the error.
Posted by Microsoft on 5/2/2011 at 7:27 PM
Hi Jymmi88,

For any build related issue we really need a /v:diag log attached. You can get them easily by going to Tools/Options, Projects/Solutions, Build/Run, and setting the MSBuild verbosity to "Diagnostic" in both dropdowns. Then, just copy/paste from the Output Window in the IDE.

For command line, you can pass in "/v:diag" switch to MSBuild.EXE and it will produce a diagnostic-level log.

Please submit this information to us within 4 business days. Thanks again for your efforts and we look forward to hearing from you.

Microsoft Visual Studio Connect Support Team


Posted by greg.schiller on 5/2/2011 at 1:41 PM
I too am getting this. It looks like VS2010 is missing a .h file in its build where the "AtlLoadSystemLibraryUsingFullPath" is not identified. I am porting older VS2008 COM object code which is getting this error.

Anything that has to do with the include file atltransactionmanager.h when it gets to this function errors out.

My errors go away when I change the projects properties platform toolset to v90 instead of v100. However this is using VS2008's platform instead of using the latest. At least I am back to being productive again.
Posted by Microsoft on 5/2/2011 at 12:17 PM
Thank you for your feedback, we are currently reviewing the issue you have submitted. If this issue is urgent, please contact support directly(http://support.microsoft.com)
Sign in to post a workaround.
Posted by ChristianTr on 12/5/2011 at 12:46 AM
My suggestion: Uninstall the Visual Studio 2010 Updates.

KB2455033 caused the problem at my PC. KB2455033 was officially replaced by KB2542054.
Posted by kefurd06 on 8/3/2011 at 6:36 AM
taken from thswnsgud, http://social.msdn.microsoft.com/Forums/en-US/vcmfcatl/thread/33fc3a28-f70b-418f-9438-3bb775928121

replace the code causing the error as follows (had to replace in three locations in the file atltransactionmanager.h:

//HMODULE hKTM32 = AtlLoadSystemLibraryUsingFullPath(L"ktmw32.dll"); HMODULE
HMODULE hKTM32= ::LoadLibrary(_T("ktmw32.dll"));
Posted by David Levinson on 5/7/2011 at 9:19 AM
I was able to work around this by replace the file ...

C:\Program Files (x86)\Microsoft Visual Studio 10.0\VC\atlmfc\include\atlcore.h

with a version from another machine.

In this the file funtion AtlLoadSystemLibraryUsingFullPath a few other details were different.
Posted by greg.schiller on 5/2/2011 at 2:13 PM
Not a long term one but...

Project Properties -> Configuration Properties -> Platform Toolset --> Change to v90. Rebuild